folio,intp,intutil,entidad,munici,locali,sexo,edad,u101,u201,u201esp,u202,u301,u302,u302esp,u401,u401esp,u402,u402esp,u403,u405a,u405b,u405c,u405d,u405e,u405f,u405g,u405h,u405esp,u501,u502,u503,u505,u506a,u506b,u507,u508,u509a,u509b,u510,u511a,u511b,u512,u513,u601a,u602,u603,u603a,u604,u604esp,u605a,u701,u702,u703,u703esp,u704a,u706,u707a,u707b,u707c,u801,u802,u803a,u803b,u803c,u803d,u803e,u803f,u803g,u803h,u803i,u803j,u803k,u803l,u803m,u803esp,u804a,u804b,u804c,u804d,u804e,u804f,u804g,u804h,u804i,u804j,u804k,u804l,u804m,u804n,u804esp,u808,u809,u810,code_upm,est_dis,est_urb,est_marg,pondef,est_var
010001,3,seleccionado para cuestionario de utilizaci�n de servicios d,01,001,0001,hombre,19,s�,enfermedad bucodental,,de 15 d�as a un mes,s�,,,seguro social (imss),,m�dico especialista,,muy bueno?,s�,no,no,no,no,s�,no,no,,s�,s�,corto?,no pag�,0,10,corto?,cerca?,0,40,largo?,0,20,no,,2,le dio explicaciones y las entendi� todas?,"s�, todos",en el mismo lugar de la consulta,,,,s�,s�,en otra unidad de la misma instituci�n,,no pag�,no,,,,mejor� mucho?,s�,no,s�,s�,no,no,no,s�,no,no,no,no,no,no,,,,,,,,,,,,,,,,,s�,le dio explicaciones y las entendi� todas?,muy buenas,M0101," baja marginalidad + [ metropolitano en  edo<>df | mpios 3,4",metropolitano,baja marginalidad,536.83063,15
010006,1,seleccionado para cuestionario de utilizaci�n de servicios d,01,001,0001,hombre,62,s�,hipertensi�n arterial,,m�s de 1 a�o,s�,,,seguro social (imss),,m�dico general,,malo?,s�,no,no,no,no,no,no,no,,no,s�,largo?,20,0,10,muy corto?,muy cerca de su casa?,1,0,muy largo?,0,10,no,,14,le dio explicaciones y las entendi� todas?,"s�, todos",en el mismo lugar de la consulta,,,,s�,s�,en la misma unidad,,no pag�,no,,,,no cambio?,s�,s�,no,no,s�,no,no,no,no,no,no,no,no,no,,,,,,,,,,,,,,,,,no,le dio explicaciones y las entendi� todas?,buenas,M0101," baja marginalidad + [ metropolitano en  edo<>df | mpios 3,4",metropolitano,baja marginalidad,319.52838,15
010006,2,seleccionado para cuestionario de utilizaci�n de servicios d,01,001,0001,mujer,60,s�,hipertensi�n arterial,,m�s de 1 a�o,s�,,,seguro social (imss),,m�dico general,,bueno?,s�,no,no,no,no,no,no,no,,no,s�,largo?,20,0,10,corto?,cerca?,1,0,largo?,0,15,no,,4,le dio explicaciones y las entendi� todas?,"s�, todos",en el mismo lugar de la consulta,,,,no,,,,,no,,,,mejor�?,s�,no,no,s�,no,no,no,no,no,no,no,no,no,no,,,,,,,,,,,,,,,,,s�,le dio explicaciones y las entendi� todas?,buenas,M0101," baja marginalidad + [ metropolitano en  edo<>df | mpios 3,4",metropolitano,baja marginalidad,377.32004,15
010011,3,seleccionado para cuestionario de utilizaci�n de servicios d,01,001,0001,mujer,33,no,,,,,,,,,,,,,,,,,,,,,,,,,,,,,,,,,,,,,,,,,,,,,,,,,,,,,,,,,,,,,,,,,,,,,,,,,,,,,,,,,,,,,,M0101," baja marginalidad + [ metropolitano en  edo<>df | mpios 3,4",metropolitano,baja marginalidad,418.5701,15
010014,2,seleccionado para cuestionario de utilizaci�n de servicios d,01,001,0001,mujer,3,s�,otro,INFECCION EN EL ESTOMAGO,menos de 15 d�as,s�,,,seguro social (imss),,m�dico general,,bueno?,no,no,s�,no,no,no,no,no,,no,no,,12,0,30,regular?,cerca?,0,40,regular?,0,15,no,,3,le dio explicaciones y las entendi� todas?,"s�, todos",en el mismo lugar de la consulta,,,,no,,,,,s�,40,ns/nr,ns/nr,mejor�?,s�,no,no,s�,no,no,no,no,no,no,no,no,no,no,,,,,,,,,,,,,,,,,s�,le dio explicaciones y las entendi� todas?,buenas,M0101," baja marginalidad + [ metropolitano en  edo<>df | mpios 3,4",metropolitano,baja marginalidad,428.17789,15
010017,3,seleccionado para cuestionario de utilizaci�n de servicios d,01,001,0001,mujer,22,s�,"tos, catarro, dolor de garganta",,menos de 15 d�as,s�,,,consultorios dependientes de farmacias,,m�dico general,,muy bueno?,no,no,no,no,no,no,s�,no,PORQUE YA SABIA QUE NO LA ATENDERIAN RAPIDO EN EL CENTRO DE SALUD Y NO TENDRIAN ,s�,no,,no pag�,0,15,corto?,cerca?,0,10,corto?,0,10,s�,30,3,le dio explicaciones y las entendi� todas?,"s�, todos",en el mismo lugar de la consulta,,,,no,,,,,no,,,,mejor�?,s�,no,no,s�,no,no,no,no,no,no,no,s�,no,no,,,,,,,,,,,,,,,,,s�,le dio explicaciones y las entendi� todas?,muy malas,M0101," baja marginalidad + [ metropolitano en  edo<>df | mpios 3,4",metropolitano,baja marginalidad,454.21481,15
010023,1,seleccionado para cuestionario de utilizaci�n de servicios d,01,001,0001,mujer,42,s�,otro,DOLOR EN LAS COSTILLAS Y EL ESTOMAGO,m�s de 3 meses a 6 meses,s�,,,centro de salud u hospital de la ssa,,m�dico general,,muy bueno?,s�,no,no,no,s�,no,no,no,,no,no,,no pag�,0,15,largo?,lejos?,4,0,regular?,0,25,no,,3,le dio explicaciones y las entendi� todas?,"s�, todos",en el mismo lugar de la consulta,,,,s�,no,,,,no,,,,no cambio?,s�,no,no,s�,s�,no,no,no,no,no,no,s�,no,no,,,,,,,,,,,,,,,,,s�,le dio explicaciones y las entendi� todas?,buenas,M0101," baja marginalidad + [ metropolitano en  edo<>df | mpios 3,4",metropolitano,baja marginalidad,418.5701,15
010037,2,seleccionado para cuestionario de utilizaci�n de servicios d,01,001,0001,mujer,51,s�,lesi�n f�sica por accidente,,m�s de 1 mes a 3 meses,s�,,,centro de salud u hospital de la ssa,,m�dico especialista,,bueno?,no,no,s�,no,no,no,no,no,,no,no,,ns/nr,0,30,corto?,regular?,3,0,muy largo?,2,0,no,,3,le dio explicaciones y las entendi� todas?,s�lo algunos,,no hab�a el medicamento en la instituci�n,,1200,s�,s�,en la misma unidad,,no pag�,no,,,,no cambio?,s�,s�,no,no,no,no,no,no,no,no,no,no,no,no,,,,,,,,,,,,,,,,,s�,le dio explicaciones y las entendi� todas?,buenas,M0101," baja marginalidad + [ metropolitano en  edo<>df | mpios 3,4",metropolitano,baja marginalidad,418.5701,15
010046,1,seleccionado para cuestionario de utilizaci�n de servicios d,01,001,0001,hombre,63,s�,otro,CHEKEO,m�s de 1 a�o,s�,,,otro lugar,SE GURO PRIBADO,m�dico especialista,,muy bueno?,s�,no,no,no,no,no,no,no,,s�,s�,muy corto?,7,0,15,muy corto?,muy cerca de su casa?,0,1,muy corto?,0,10,no,,2,le dio explicaciones y las entendi� todas?,"s�, todos",en el mismo lugar de la consulta,,,,no,,,,,no,,,,mejor�?,s�,no,s�,s�,no,s�,no,s�,s�,no,no,no,no,no,,,,,,,,,,,,,,,,,s�,le dio explicaciones y las entendi� todas?,muy buenas,M0102," baja marginalidad + [ metropolitano en  edo<>df | mpios 3,4",metropolitano,baja marginalidad,207.98241,15
010046,2,seleccionado para cuestionario de utilizaci�n de servicios d,01,001,0001,mujer,61,s�,otro,CHEKEO,m�s de 1 a�o,s�,,,otro lugar,SERGURO BANCARIO,m�dico especialista,,muy malo?,s�,no,no,no,no,no,no,no,,s�,s�,adecuado?,7,0,15,corto?,muy cerca de su casa?,0,1,muy corto?,0,15,no,,2,le dio explicaciones y las entendi� todas?,"s�, todos",en el mismo lugar de la consulta,,,,s�,no,,,,no,,,,no cambio?,s�,no,s�,s�,no,no,no,no,s�,s�,no,no,no,no,,,,,,,,,,,,,,,,,s�,le dio explicaciones y las entendi� todas?,muy buenas,M0102," baja marginalidad + [ metropolitano en  edo<>df | mpios 3,4",metropolitano,baja marginalidad,245.59923,15
010051,2,seleccionado para cuestionario de utilizaci�n de servicios d,01,001,0001,mujer,55,s�,alergias,,menos de 15 d�as,s�,,,centro de salud u hospital de la ssa,,m�dico general,,muy bueno?,no,s�,no,no,no,no,no,no,,s�,no,,6,0,40,largo?,cerca?,0,30,regular?,0,30,no,,4,le dio explicaciones y las entendi� todas?,"s�, todos",en una farmacia particular,,,,no,,,,,no,,,,mejor� mucho?,s�,no,s�,no,no,no,no,no,no,no,no,no,no,no,,,,,,,,,,,,,,,,,s�,le dio explicaciones y las entendi� todas?,regulares,M0102," baja marginalidad + [ metropolitano en  edo<>df | mpios 3,4",metropolitano,baja marginalidad,231.47511,15
010053,2,seleccionado para cuestionario de utilizaci�n de servicios d,01,001,0001,mujer,55,s�,otro,TENDONITIS EN EL BRAZO,menos de 15 d�as,s�,,,m�dico privado,,m�dico especialista,,muy bueno?,no,no,no,no,no,no,s�,no,SELO RECOMENDARON Y ES ESPECIALISTA,s�,s�,adecuado?,no pag�,0,10,corto?,regular?,0,15,corto?,1,0,s�,1500,3,le dio explicaciones y las entendi� todas?,"s�, todos",en una farmacia particular,,,,s�,s�,en otra unidad de la misma instituci�n,,500,no,,,,mejor�?,s�,no,no,no,no,no,no,no,no,no,s�,s�,no,no,,,,,,,,,,,,,,,,,s�,le dio explicaciones y las entendi� todas?,buenas,M0102," baja marginalidad + [ metropolitano en  edo<>df | mpios 3,4",metropolitano,baja marginalidad,462.95023,15
010054,3,seleccionado para cuestionario de utilizaci�n de servicios d,01,001,0001,mujer,26,s�,"tos, catarro, dolor de garganta",,menos de 15 d�as,s�,,,m�dico privado,,m�dico general,,muy bueno?,no,no,no,no,no,s�,no,no,,s�,no,,no pag�,0,10,muy largo?,cerca?,0,1,corto?,0,30,s�,150,3,le dio explicaciones y las entendi� todas?,"s�, todos",en una farmacia particular,,,,no,,,,,no,,,,mejor� mucho?,s�,no,s�,no,no,no,no,no,no,no,no,s�,no,no,,,,,,,,,,,,,,,,,no,le dio explicaciones y las entendi� todas?,muy buenas,M0102," baja marginalidad + [ metropolitano en  edo<>df | mpios 3,4",metropolitano,baja marginalidad,251.18715,15
010057,2,seleccionado para cuestionario de utilizaci�n de servicios d,01,001,0001,mujer,51,s�,otro,PITRIASIS ROSADA  DE GILBERT,menos de 15 d�as,s�,,,m�dico privado,,otro,DERMATOLOGA,muy bueno?,no,s�,no,s�,no,no,no,no,,s�,s�,adecuado?,no pag�,0,15,corto?,cerca?,0,10,corto?,0,25,s�,500,6,le dio explicaciones y las entendi� todas?,"s�, todos",en una farmacia particular,,,,no,,,,,no,,,,mejor�?,s�,no,s�,s�,no,s�,no,no,no,no,no,s�,no,no,,,,,,,,,,,,,,,,,s�,le dio explicaciones y las entendi� todas?,muy buenas,M0102," baja marginalidad + [ metropolitano en  edo<>df | mpios 3,4",metropolitano,baja marginalidad,231.47511,15
010062,3,seleccionado para cuestionario de utilizaci�n de servicios d,01,001,0001,mujer,1,s�,otro,INFEECCION ESTOMACAL,menos de 15 d�as,s�,,,consultorios dependientes de farmacias,,m�dico general,,muy bueno?,no,s�,s�,no,no,no,no,no,,no,no,,no pag�,0,10,regular?,cerca?,0,20,regular?,0,10,no,,3,le dio explicaciones y las entendi� todas?,"s�, todos",en el mismo lugar de la consulta,,,,no,,,,,no,,,,mejor�?,s�,s�,no,no,no,s�,no,no,no,no,no,no,no,no,,,,,,,,,,,,,,,,,no,le dio explicaciones y las entendi� todas?,regulares,M0102," baja marginalidad + [ metropolitano en  edo<>df | mpios 3,4",metropolitano,baja marginalidad,278.70282,15
010069,5,seleccionado para cuestionario de utilizaci�n de servicios d,01,001,0001,mujer,17,s�,"tos, catarro, dolor de garganta",,menos de 15 d�as,s�,,,pemex,,m�dico general,,muy bueno?,s�,no,no,s�,no,no,no,no,,no,no,,no pag�,0,10,corto?,cerca?,0,20,corto?,0,25,no,,1,le dio explicaciones y las entendi� todas?,"s�, todos",en el mismo lugar de la consulta,,,,no,,,,,no,,,,mejor�?,s�,no,s�,no,no,no,no,no,s�,no,no,s�,no,no,,,,,,,,,,,,,,,,,s�,le dio explicaciones y las entendi� todas?,muy buenas,M0102," baja marginalidad + [ metropolitano en  edo<>df | mpios 3,4",metropolitano,baja marginalidad,251.18715,15
010070,2,seleccionado para cuestionario de utilizaci�n de servicios d,01,001,0001,mujer,58,s�,otro,GINECOLOGO,menos de 15 d�as,s�,,,seguro social (imss),,m�dico especialista,,bueno?,s�,no,no,no,no,no,no,no,,no,s�,adecuado?,20,0,10,regular?,regular?,2,30,muy largo?,0,15,no,,2,le dio explicaciones y las entendi� todas?,"s�, todos",en el mismo lugar de la consulta,,,,no,,,,,no,,,,mejor�?,s�,s�,no,no,no,no,no,no,no,no,no,s�,no,no,,,,,,,,,,,,,,,,,s�,le dio explicaciones y las entendi� todas?,buenas,M0102," baja marginalidad + [ metropolitano en  edo<>df | mpios 3,4",metropolitano,baja marginalidad,245.59923,15
010074,2,seleccionado para cuestionario de utilizaci�n de servicios d,01,001,0001,mujer,71,s�,diabetes,,m�s de 1 a�o,s�,,,seguro social (imss),,m�dico general,,bueno?,s�,no,no,no,no,no,no,no,,no,s�,adecuado?,no pag�,0,15,regular?,regular?,0,15,regular?,0,20,no,,3,le dio explicaciones y las entendi� todas?,"s�, todos",en el mismo lugar de la consulta,,,,s�,s�,en la misma unidad,,no pag�,s�,500,ns/nr,ns/nr,mejor�?,s�,no,s�,s�,no,no,no,no,no,no,no,no,no,no,,,,,,,,,,,,,,,,,s�,le dio explicaciones y las entendi� todas?,regulares,M0102," baja marginalidad + [ metropolitano en  edo<>df | mpios 3,4",metropolitano,baja marginalidad,289.07333,15
010077,1,seleccionado para cuestionario de utilizaci�n de servicios d,01,001,0001,hombre,82,s�,otro,CONSULTA MEDICA PROGRAMADA Y CONTROL DE LA HIPERTENSION,menos de 15 d�as,s�,,,issste,,m�dico especialista,,bueno?,s�,no,no,no,no,no,no,no,,s�,s�,adecuado?,no pag�,0,15,corto?,cerca?,0,45,largo?,0,30,no,,2,le dio explicaciones y las entendi� todas?,"s�, todos",en el mismo lugar de la consulta,,,,s�,no,,,,no,,,,mejor�?,s�,no,no,s�,no,no,no,no,s�,no,no,no,no,no,,,,,,,,,,,,,,,,,s�,le dio explicaciones y las entendi� todas?,regulares,M0102," baja marginalidad + [ metropolitano en  edo<>df | mpios 3,4",metropolitano,baja marginalidad,207.98241,15
010080,2,seleccionado para cuestionario de utilizaci�n de servicios d,01,001,0001,mujer,57,s�,infecciones respiratorias,,menos de 15 d�as,s�,,,seguro social (imss),,m�dico general,,bueno?,s�,no,no,no,no,no,no,no,,no,s�,adecuado?,24,0,20,regular?,regular?,2,0,largo?,0,20,no,,5,le dio explicaciones y las entendi� todas?,"s�, todos",en el mismo lugar de la consulta,,,,no,,,,,no,,,,mejor�?,s�,no,s�,no,s�,no,no,no,s�,no,no,no,no,no,,,,,,,,,,,,,,,,,s�,le dio explicaciones y las entendi� todas?,regulares,M0102," baja marginalidad + [ metropolitano en  edo<>df | mpios 3,4",metropolitano,baja marginalidad,245.59923,15
010081,3,seleccionado para cuestionario de utilizaci�n de servicios d,01,001,0001,hombre,5,s�,"tos, catarro, dolor de garganta",,menos de 15 d�as,s�,,,m�dico privado,,m�dico especialista,,muy bueno?,no,no,no,no,no,s�,no,no,,s�,s�,adecuado?,no pag�,0,10,corto?,cerca?,0,1,corto?,0,30,s�,300,6,le dio explicaciones y las entendi� todas?,"s�, todos",en una farmacia particular,,,,s�,s�,en otra unidad de la misma instituci�n,,200,no,,,,mejor�?,s�,no,s�,no,no,no,no,s�,no,no,no,s�,no,no,,,,,,,,,,,,,,,,,s�,le dio explicaciones y las entendi� todas?,buenas,M0102," baja marginalidad + [ metropolitano en  edo<>df | mpios 3,4",metropolitano,baja marginalidad,271.5386,15
010081,4,seleccionado para cuestionario de utilizaci�n de servicios d,01,001,0001,mujer,2,s�,"tos, catarro, dolor de garganta",,menos de 15 d�as,s�,,,m�dico privado,,m�dico especialista,,bueno?,no,s�,no,no,no,no,no,no,,s�,s�,adecuado?,no pag�,0,10,corto?,cerca?,0,1,corto?,0,30,s�,300,6,le dio explicaciones y las entendi� todas?,"s�, todos",en una farmacia particular,,,,s�,s�,en otra unidad de la misma instituci�n,,200,no,,,,mejor�?,s�,no,s�,s�,no,s�,no,no,s�,no,no,no,no,no,,,,,,,,,,,,,,,,,no,le dio explicaciones y las entendi� todas?,muy buenas,M0102," baja marginalidad + [ metropolitano en  edo<>df | mpios 3,4",metropolitano,baja marginalidad,278.70282,15
010085,1,seleccionado para cuestionario de utilizaci�n de servicios d,01,001,0001,hombre,48,s�,asma,,m�s de 1 a�o,s�,,,consultorios dependientes de farmacias,,m�dico general,,bueno?,no,no,s�,no,s�,no,no,no,,s�,no,,no pag�,0,10,muy corto?,muy cerca de su casa?,0,15,regular?,0,10,no,,2,le dio explicaciones y las entendi� todas?,"s�, todos",en el mismo lugar de la consulta,,,,no,,,,,no,,,,mejor�?,s�,no,no,no,s�,s�,no,no,no,no,no,no,no,no,,,,,,,,,,,,,,,,,s�,le dio explicaciones y las entendi� todas?,buenas,M0103," baja marginalidad + [ metropolitano en  edo<>df | mpios 3,4",metropolitano,baja marginalidad,290.53137,15
010085,2,seleccionado para cuestionario de utilizaci�n de servicios d,01,001,0001,mujer,47,s�,infecciones respiratorias,,menos de 15 d�as,s�,,,m�dico privado,,m�dico general,,bueno?,no,s�,no,no,no,s�,no,no,,no,no,,no pag�,0,5,muy corto?,cerca?,0,10,regular?,0,20,s�,200,3,le dio explicaciones y las entendi� todas?,"s�, todos",en una farmacia particular,,,,no,,,,,no,,,,mejor�?,s�,no,no,no,no,s�,no,s�,no,no,no,no,no,no,,,,,,,,,,,,,,,,,s�,le dio explicaciones y las entendi� todas?,buenas,M0103," baja marginalidad + [ metropolitano en  edo<>df | mpios 3,4",metropolitano,baja marginalidad,265.75964,15
010101,2,seleccionado para cuestionario de utilizaci�n de servicios d,01,001,0001,mujer,36,s�,lesi�n f�sica por accidente,,de 15 d�as a un mes,s�,,,seguro social (imss),,m�dico general,,bueno?,s�,no,no,no,no,no,no,no,,no,no,,50,0,15,corto?,cerca?,1,0,muy largo?,0,15,no,,2,�no le dio explicaciones?,"s�, todos",en el mismo lugar de la consulta,,,,no,,,,,no,,,,no cambio?,s�,s�,no,no,no,no,no,no,no,no,no,no,s�,no,POR QUE ES OBLIGACION DEL SEGURO SOCIAL QUE LA ATIENDAN YA QUE POR ESO PAGA EL S,,,,,,,,,,,,,,,,s�,le dio explicaciones y las entendi� todas?,buenas,M0103," baja marginalidad + [ metropolitano en  edo<>df | mpios 3,4",metropolitano,baja marginalidad,312.8024,15
010112,2,seleccionado para cuestionario de utilizaci�n de servicios d,01,001,0001,mujer,61,s�,hipertensi�n arterial,,m�s de 1 a�o,s�,,,seguro social (imss),,m�dico general,,muy bueno?,s�,s�,no,no,no,s�,no,no,,no,s�,adecuado?,no pag�,0,20,corto?,cerca?,0,15,corto?,0,20,no,,4,le dio explicaciones y las entendi� todas?,"s�, todos",en el mismo lugar de la consulta,,,,s�,no,,,,no,,,,no cambio?,s�,no,s�,s�,no,no,no,no,no,no,no,no,no,no,,,,,,,,,,,,,,,,,s�,le dio explicaciones y las entendi� todas?,muy buenas,M0103," baja marginalidad + [ metropolitano en  edo<>df | mpios 3,4",metropolitano,baja marginalidad,563.95142,15
010113,2,seleccionado para cuestionario de utilizaci�n de servicios d,01,001,0001,mujer,75,s�,conjuntivitis,,m�s de 1 a�o,s�,,,m�dico privado,,m�dico especialista,,bueno?,s�,no,no,s�,s�,no,no,no,,s�,s�,adecuado?,64,0,10,corto?,cerca?,0,30,corto?,0,30,s�,500,2,le dio explicaciones y las entendi� todas?,"s�, todos",en una farmacia particular,,,,no,,,,,no,,,,mejor�?,s�,no,no,s�,no,s�,no,no,no,no,no,no,no,no,,,,,,,,,,,,,,,,,s�,le dio explicaciones y las entendi� todas?,buenas,M0103," baja marginalidad + [ metropolitano en  edo<>df | mpios 3,4",metropolitano,baja marginalidad,281.97571,15
010115,1,seleccionado para cuestionario de utilizaci�n de servicios d,01,001,0001,mujer,78,s�,enfermedades renales,,m�s de 1 a�o,s�,,,m�dico privado,,m�dico general,,muy bueno?,no,no,no,no,no,s�,no,no,,s�,no,,no pag�,0,30,regular?,lejos?,0,20,regular?,0,10,s�,300,4,le dio explicaciones y las entendi� todas?,"s�, todos",en una farmacia particular,,,,no,,,,,no,,,,mejor�?,s�,no,no,s�,no,no,no,no,no,no,no,s�,no,no,,,,,,,,,,,,,,,,,s�,le dio explicaciones y las entendi� todas?,buenas,M0103," baja marginalidad + [ metropolitano en  edo<>df | mpios 3,4",metropolitano,baja marginalidad,281.97571,15
010117,1,seleccionado para cuestionario de utilizaci�n de servicios d,01,001,0001,hombre,42,s�,artritis,,m�s de 1 a�o,s�,,,seguro social (imss),,m�dico general,,bueno?,s�,s�,s�,no,no,no,no,no,,s�,s�,corto?,no pag�,0,20,regular?,regular?,0,30,largo?,0,10,no,,4,le dio explicaciones y las entendi� todas?,"s�, todos",en el mismo lugar de la consulta,,,,s�,s�,en la misma unidad,,no pag�,no,,,,mejor�?,s�,no,no,no,s�,no,no,no,no,no,no,s�,no,no,,,,,,,,,,,,,,,,,s�,le dio explicaciones y las entendi� todas?,buenas,M0103," baja marginalidad + [ metropolitano en  edo<>df | mpios 3,4",metropolitano,baja marginalidad,290.53137,15
010117,2,seleccionado para cuestionario de utilizaci�n de servicios d,01,001,0001,mujer,44,s�,hipertensi�n arterial,,m�s de 6 meses a 1 a�o,s�,,,seguro social (imss),,m�dico general,,regular?,s�,no,s�,no,no,no,no,no,,no,s�,largo?,60,0,20,regular?,regular?,0,40,largo?,0,20,no,,7,�no le dio explicaciones?,"s�, todos",en el mismo lugar de la consulta,,,,s�,s�,en la misma unidad,,no pag�,no,,,,no cambio?,s�,s�,no,no,s�,no,no,no,s�,no,no,no,no,no,,,,,,,,,,,,,,,,,no,le dio explicaciones y las entendi� todas?,buenas,M0103," baja marginalidad + [ metropolitano en  edo<>df | mpios 3,4",metropolitano,baja marginalidad,265.75964,15
010121,1,seleccionado para cuestionario de utilizaci�n de servicios d,01,001,0001,hombre,69,s�,hipertensi�n arterial,,m�s de 1 a�o,s�,,,issste,,m�dico general,,regular?,s�,no,no,no,no,no,no,no,,s�,s�,adecuado?,20,0,7,regular?,regular?,0,15,regular?,0,5,no,,4,le dio explicaciones y las entendi� todas?,no,,no hab�a el medicamento en la instituci�n,,,no,,,,,no,,,,mejor�?,s�,s�,no,no,no,no,no,no,no,no,no,no,no,no,,,,,,,,,,,,,,,,,s�,le dio explicaciones y las entendi� todas?,regulares,M0103," baja marginalidad + [ metropolitano en  edo<>df | mpios 3,4",metropolitano,baja marginalidad,238.78734,15
010123,2,seleccionado para cuestionario de utilizaci�n de servicios d,01,001,0001,mujer,62,s�,otro,CHEQUEO SEMESTRAL CANSER,m�s de 1 a�o,s�,,,seguro social (imss),,m�dico especialista,,muy bueno?,s�,no,s�,no,no,no,no,no,,no,s�,adecuado?,52,0,20,regular?,cerca?,0,30,regular?,0,7,no,,no le recetaron medicamentos,,,,,,,s�,no,,,,no,,,,mejor�?,s�,s�,no,s�,no,no,no,no,no,no,no,no,no,no,,,,,,,,,,,,,,,,,s�,le dio explicaciones y las entendi� todas?,muy buenas,M0103," baja marginalidad + [ metropolitano en  edo<>df | mpios 3,4",metropolitano,baja marginalidad,281.97571,15
010124,2,seleccionado para cuestionario de utilizaci�n de servicios d,01,001,0001,mujer,55,s�,"tos, catarro, dolor de garganta",,menos de 15 d�as,s�,,,m�dico privado,,m�dico general,,muy bueno?,no,no,no,s�,s�,s�,no,no,,no,no,,no pag�,0,1,muy corto?,muy cerca de su casa?,0,1,muy corto?,0,20,no,,3,le dio explicaciones y las entendi� todas?,"s�, todos",en una farmacia particular,,,,no,,,,,no,,,,mejor� mucho?,s�,no,s�,s�,no,no,no,no,no,no,no,s�,no,no,,,,,,,,,,,,,,,,,s�,le dio explicaciones y las entendi� todas?,muy buenas,M0103," baja marginalidad + [ metropolitano en  edo<>df | mpios 3,4",metropolitano,baja marginalidad,265.75964,15
010130,2,seleccionado para cuestionario de utilizaci�n de servicios d,01,001,0001,mujer,52,s�,"tos, catarro, dolor de garganta",,menos de 15 d�as,s�,,,consultorios dependientes de farmacias,,m�dico general,,bueno?,no,no,s�,no,no,no,no,no,,s�,no,,no pag�,0,10,corto?,cerca?,0,15,corto?,0,15,s�,20,1,le dio explicaciones y las entendi� todas?,"s�, todos",en el mismo lugar de la consulta,,,,no,,,,,no,,,,mejor� mucho?,s�,no,no,no,no,s�,s�,s�,no,no,no,no,no,no,,,,,,,,,,,,,,,,,s�,le dio explicaciones y las entendi� todas?,regulares,M0104," baja marginalidad + [ metropolitano en  edo<>df | mpios 3,4",metropolitano,baja marginalidad,258.75659,15
010131,2,seleccionado para cuestionario de utilizaci�n de servicios d,01,001,0001,mujer,53,no,,,,,,,,,,,,,,,,,,,,,,,,,,,,,,,,,,,,,,,,,,,,,,,,,,,,,,,,,,,,,,,,,,,,,,,,,,,,,,,,,,,,,,M0104," baja marginalidad + [ metropolitano en  edo<>df | mpios 3,4",metropolitano,baja marginalidad,258.75659,15
010140,1,seleccionado para cuestionario de utilizaci�n de servicios d,01,001,0001,hombre,52,s�,tabaquismo,,menos de 15 d�as,s�,,,seguro social (imss),,m�dico especialista,,muy bueno?,s�,no,no,no,no,no,no,no,,no,no,,no pag�,0,5,regular?,muy cerca de su casa?,0,1,muy corto?,23,0,no,,7,le dio explicaciones y las entendi� todas?,"s�, todos",en el mismo lugar de la consulta,,,,no,,,,,no,,,,mejor� mucho?,s�,no,s�,s�,no,no,no,no,no,no,no,no,no,no,,,,,,,,,,,,,,,,,s�,le dio explicaciones y las entendi� todas?,muy buenas,M0104," baja marginalidad + [ metropolitano en  edo<>df | mpios 3,4",metropolitano,baja marginalidad,282.87555,15
010143,4,seleccionado para cuestionario de utilizaci�n de servicios d,01,001,0001,mujer,28,no,,,,,,,,,,,,,,,,,,,,,,,,,,,,,,,,,,,,,,,,,,,,,,,,,,,,,,,,,,,,,,,,,,,,,,,,,,,,,,,,,,,,,,M0104," baja marginalidad + [ metropolitano en  edo<>df | mpios 3,4",metropolitano,baja marginalidad,330.49548,15
010145,5,seleccionado para cuestionario de utilizaci�n de servicios d,01,001,0001,mujer,6,s�,"tos, catarro, dolor de garganta",,menos de 15 d�as,s�,,,consultorios dependientes de farmacias,,m�dico general,,bueno?,no,no,no,no,no,no,s�,no,POR QUE SE ENFERMO DE RAPIDO,s�,no,,no pag�,0,5,corto?,cerca?,30,0,regular?,0,20,s�,20,3,le dio explicaciones y las entendi� todas?,s�lo algunos,,no hab�a el medicamento en la instituci�n,,50,no,,,,,no,,,,mejor�?,s�,no,no,no,no,s�,no,no,no,no,no,no,no,no,,,,,,,,,,,,,,,,,s�,le dio explicaciones y las entendi� todas?,buenas,M0104," baja marginalidad + [ metropolitano en  edo<>df | mpios 3,4",metropolitano,baja marginalidad,311.55051,15