folio,intp,entidad,ent,munici,locali,sexo,edad,asexo,aedad,aedadns,a1400,a14a01,a14a03a,a14a03b,a14a03c,a14a03_a,a14a05,a14a06,a14a07,a14a08,a14a09a,a14a09b,a14a09c,a14a10,a14a11,a14a12,a14b01,a14b02,a14g01,a14g02,a14c01,a14c021,a14c022,a14c023,a14c024,a14c025,a14c026,a14c027,a14c03,a14c04,a14c05,a14e01,a14e02,a14e03,a14e04,a14e05,a14e06,a14e07,a14e08,a14e09,a14e10,a14e11,a14f02,a14f03,a001,a002,a101h,a101m,a101ah,a101am,a201_a,a201_b,a201_c,a201_d,a201_e,a201_f,a201_g,a201_h,a201_i,a202,a203,a204,a301,a302a,a302b,a303,a305,a306a,a306b,a306c,a306d,a306e,a306f,a306g,a306h,a306i,a306j,a306k,a306l,a306esp,a307,a308a,a308b,a309a,a309b,a309c,a309d,a309e,a309f,a310a,a310b,a310c,a310d,a310e,a310f,a310g,a310h,a311e1,a311e2,a311e3,a311e4,a311e5,a311e6,a311e7,a312a,a312b,a312c,a312d,a312e,a312f,a312esp,a313a,a313b,a313c,a313d,a313e,a313f,a313g,a313h,a313i,a401,a402a,a402b,a403,a404,a405,a406a,a406b,a406c,a406d,a406e,a406f,a406g,a406h,a406i,a406j,a406k,a406l,a406esp,a407a,a407b,a407c,a407d,a407e,a407f,a407g,a408a,a408b,a501,a502a,a502b,a502c,a502d,a502desp,a601,a602a,a602b,a602c,a602d,a603,a604,a701a,a702a,a703a,a704a,a705a,a706a,a701b,a702b,a703b,a704b,a705b,a706b,a801,a802a,a802b,a802c,a802d,a802e,a802f,a802g,a802h,a802i,a802j,a802k,a802l,a802m,a802n,a802o,a802esp,a803a,a803b,a803c,a803d,a803e,a803f,a803g,a803h,a803i,a803j,a803k,a803l,a803m,a803n,a803o,a803esp,a804,a802_ba,a802_bb,a802_bc,a802_bd,a802_be,a802_bf,a802_bsp,a807a,a807b,a808,a808esp,a811,a811a,a812,a813_1,a813_2,a813_3,a813_4,a815,a817,a818,a819,a819esp,a820,a821a,a821b,a821c,a821d,a821e,a821f,a821g,a821h,a821i,a821j,a821k,a821l,a822a,a822b,a822c,a822d,a822e,a822f,a822g,a822h,a822i,a822j,a823,a824,a824esp,a825,a826a,a826b,a826c,a826d,a826e,a826f,a826g,a826h,a831,a828a_1,a828a_2,a840,a813da,a813db,a832,a832a,a832aesp,a833b,a833c,a833da,a833db,a833dc,a833dd,a833de,a833df,a833dg,a833dh,a833di,a833dj,a833dk,a833dl,a833dm,a833dn,a833do,a833dp,a833dq,a833desp,a833a_a,a833a_b,a833a_c,a833a_d,a833a_e,a833aesp,a835,a836,a835a,a837,a837esp,a839,a834,a8a13a,a8a13b,a8a13b1a,a8a13b1b,a8a13c_1,a8a13c_2,a8a13d,a8a13ea,a8a13eb,a8a13fa,a8a13fb,a8a13fc,a8a13fd,a8a13fe,a8a13ff,a8a13fg,a8a13fh,a8a13fi,a8a13fj,a8a13fk,a8a13fl,a8a13fm,a8a13fn,a8a13fes,a901a,a901b,a905,a906,a909,a910,a915a,a915b,a920,a924,a925,a927,a1000a,a1000b,a1000bsp,a1001a,a1002a,a1002asp,a1005a,a1006a,a1007a,a1001b,a1002b,a1002bsp,a1005b,a1006b,a1007b,a1001c,a1002c,a1002csp,a1005c,a1006c,a1007c,a1001d,a1002d,a1002dsp,a1005d,a1006d,a1007d,a1001e,a1002e,a1002esp,a1005e,a1006e,a1007e,a1001f,a1002f,a1002fsp,a1005f,a1006f,a1007f,a1001g,a1002g,a1002gsp,a1005g,a1006g,a1007g,a1008a,a1009a,a1010a,a1011a,a1012aa,a1012ab,a1013a,a1013asp,a1014a,a1016a,a1017a,a1018a,a1008b,a1009b,a1010b,a1011b,a1012ba,a1012bb,a1013b,a1013bsp,a1014b,a1016b,a1017b,a1018b,a1008c,a1009c,a1010c,a1011c,a1012ca,a1012cb,a1013c,a1013csp,a1014c,a1016c,a1017c,a1018c,a1008d,a1009d,a1010d,a1011d,a1012da,a1012db,a1013d,a1013dsp,a1014d,a1016d,a1017d,a1018d,a1101,a1102,a1102a,a1102b,a1103,a1104a,a1104b,a1104c,a1104d,a1104e,a1104f,a1104h,a1104i,a1104j,a1104l,a1104lsp,a1105,a1105esp,a1106,a1106esp,a1107,a1107esp,a1201,a1202a,a1202b,a1202c,a1202d,a1202e,a1202f,a1202g,a1202h,a1202i,a1202j,a1202k,a1202l,a1202esp,a1203,a1203esp,a1204,a1204esp,a1206,a1206esp,a1207,a1207esp,a1208,a1208esp,a1301,a1302,a1303a,a1303b,a1304,a1306,a1310,a1311,a1312,code_upm,est_dis,est_urb,est_marg,pondef,est_var,año_nac,ult_hnv,inst_parto
010001,1,01,1,001,0001,hombre,41,hombre,41,,no presenta los problemas 1 y 2,,,,,,,,,,,,,,,,,,,,,,,,,,,,,,,,,,,,,,,,,,,,no,,m,,k,,rara vez o nunca (menos de un d�a),rara vez o nunca (menos de un d�a),rara vez o nunca (menos de un d�a),rara vez o nunca (menos de un d�a),rara vez o nunca (menos de un d�a),todo el tiempo o la mayor�a del tiempo (5 - 7 d�as),rara vez o nunca (menos de un d�a),,,s�,s�,s�,no,,,,,,,,,,,,,,,,,,,,,,,,,,,,,,,,,,,,,,,,,,,,,,,,,,,,,,,,,,no,,,,,,,,,,,,,,,,,,,,,,,,,,,,no,no,no,no,no,,no,,,,,no,no,no,,s�,38,no,,no,,no,,no,,19,s�,no,no,no,no,no,no,no,no,no,no,no,no,no,no,,no,no,no,no,no,no,no,no,no,no,no,no,s�,no,no,,,,,,,,,,,,,,,,,,,,,,,,,,,,,,,,,,,,,,,,,,,,,,,,,,,,,,,,,,,,,,,,,,,,,,s�,15,s�,no,no,no,no,no,no,no,no,no,no,no,no,no,no,no,no,,no,no,no,no,no,,no,,,ns/nr,,,,,,,,,,,,,,,,,,,,,,,,,,,,"s�, pero no la mostr�",,no,,"si, dice haberse aplicado la vacuna",2,,,,,,,no,,,no,,,,,,no,,,,,,no,,,,,,no,,,,,,no,,,,,,no,,,,,,no,,,,,,,,,,,,,,,,,,,,,,,,,,,,,,,,,,,,,,,,,,,,,,,,,,,,,,no,,,,,,,,,,,,,,,,,,,,,,no,,,,,,,,,,,,,,,,,,,,,,,,s�,16,actualmente no fuma,88,,,18,actualmente no toma,nunca,M0101," baja marginalidad + [ metropolitano en  edo<>df | mpios 3,4",metropolitano,baja marginalidad,725.07648,15,,,
010003,1,01,1,001,0001,hombre,32,hombre,32,,no presenta los problemas 1 y 2,,,,,,,,,,,,,,,,,,,,,,,,,,,,,,,,,,,,,,,,,,,,no,,l,,k,,rara vez o nunca (menos de un d�a),rara vez o nunca (menos de un d�a),rara vez o nunca (menos de un d�a),rara vez o nunca (menos de un d�a),rara vez o nunca (menos de un d�a),todo el tiempo o la mayor�a del tiempo (5 - 7 d�as),rara vez o nunca (menos de un d�a),,,no,,,no,,,,,,,,,,,,,,,,,,,,,,,,,,,,,,,,,,,,,,,,,,,,,,,,,,,,,,,,,,no,,,,,,,,,,,,,,,,,,,,,,,,,,,,no,no,no,no,no,,s� y lo encontraron normal,,,,,s� y los encontraron normales,no,s�,45,no,,no,,no,,s�,61,s�,54,18,s�,no,no,no,no,no,no,no,no,no,no,no,no,no,no,,no,no,no,no,no,no,no,no,no,s�,no,no,no,no,no,,s�,no,s�,s�,no,no,no,,,,,,,,,,,,,,,,,,,,,,,,,,,,,,,,,,,,,,,,,,,,,,,,,,,,,,,,,,,,,,s�,100,s�,no,no,no,no,no,no,no,no,no,no,no,no,no,no,no,no,,no,no,no,no,no,,s�,s�,s�,ns/nr,,,no recuerda,,,,,,,,,,,,,,,,,,,,,,,,,"s�, pero no la mostr�",,"si, dice haberse aplicado la vacuna",3,"si, dice haberse aplicado la vacuna",2,,,,,,,no,,,no,,,,,,s�,seguro social (imss),,negativo,,,s�,seguro social (imss),,negativo,,,s�,seguro social (imss),,negativo,,,s�,seguro social (imss),,negativo,,,no,,,,,,no,,,,,,,,,,,,,,,,,,,,,,,,,,,,,,,,,,,,,,,,,,,,,,,,,,,,,,no,,,,,,,,,,,,,,,,,,,,,,no,,,,,,,,,,,,,,,,,,,,,,,,nunca he fumado,,,,,,16,actualmente no toma,nunca,M0101," baja marginalidad + [ metropolitano en  edo<>df | mpios 3,4",metropolitano,baja marginalidad,1519.6123,15,,,
010005,1,01,1,001,0001,hombre,66,hombre,66,,no presenta los problemas 1 y 2,no,correcto,correcto,correcto,10,no presenta alguno de los problemas anteriores y se neg� a h,,,,correcto,correcto,incorrecto,si la suma es 1 o m�s,,,no,buena,no,buena,s�,satisfecho(a),satisfecho(a),satisfecho(a),satisfecho(a),satisfecho(a),satisfecho(a),satisfecho(a),no,no,s�,no,no,no,no,,no lo hace,no,no,no,,ha comido igual,ninguna,,no,,m,,l,,rara vez o nunca (menos de un d�a),rara vez o nunca (menos de un d�a),rara vez o nunca (menos de un d�a),rara vez o nunca (menos de un d�a),rara vez o nunca (menos de un d�a),todo el tiempo o la mayor�a del tiempo (5 - 7 d�as),rara vez o nunca (menos de un d�a),,,no,,,no,,,,,,,,,,,,,,,,,,,,,,,,,,,,,,,,,,,,,,,,,,,,,,,,,,,,,,,,,,no,,,,,,,,,,,,,,,,,,,,,,,,,,,,no,no,no,no,no,,s� y lo encontraron normal,,,,,s� y los encontraron normales,no,no,,no,,no,,no,,no,,s�,89,,,,,,,,,,,,,,,,,,,,,,,,,,,,,,,,,,,,,,,,,,,,,,,,,,,,,,,,,,,,,,,,,,,,,,,,,,,,,,,,,,,,,,,,,,,,,,,,,,,,,,,,,,,,,,,,,,,,,,,,,,,,,,,,,,,,,,,,,,,,,,,,,,,,,,,,,,,,,,,,,,,,,no tiene cartilla,,no,no,,no,no,,,no,,,,,,s�,m�dico privado,,negativo,,,no,,,,,,s�,m�dico privado,,negativo,,,s�,m�dico privado,,negativo,,,s�,m�dico privado,,negativo,,,no,,,,,,,,,,,,,,,,,,,,,,,,,,,,,,,,,,,,,,,,,,,,,,,,,,,,,,no,,,,,,,,,,,,,,,,,,,,,,no,,,,,,,,,,,,,,,,,,,,,,,,s�,16,actualmente no fuma,88,,,17,actualmente no toma,nunca,M0101," baja marginalidad + [ metropolitano en  edo<>df | mpios 3,4",metropolitano,baja marginalidad,460.47809,15,,,
010006,2,01,1,001,0001,mujer,60,mujer,60,,no presenta los problemas 1 y 2,no,correcto,correcto,correcto,9,realiz� la prueba,s�,no,s�,correcto,correcto,correcto,si la suma es 1 o m�s,,,no,muy buena,no,buena,s�,satisfecho(a),satisfecho(a),satisfecho(a),satisfecho(a),satisfecho(a),muy satisfecho(a),muy satisfecho(a),s�,s�,no aplica,no,no,no,no,,no,no,no,no,,ha comido menos,ninguna,,s�,s�,,c,,c,rara vez o nunca (menos de un d�a),rara vez o nunca (menos de un d�a),rara vez o nunca (menos de un d�a),rara vez o nunca (menos de un d�a),rara vez o nunca (menos de un d�a),todo el tiempo o la mayor�a del tiempo (5 - 7 d�as),rara vez o nunca (menos de un d�a),,,no,,,no,,,,,,,,,,,,,,,,,,,,,,,,,,,,,,,,,,,,,,,,,,,,,,,,,,,,,,,,,,s�,menos de un mes,6,no,,s�,s�,no,no,no,no,no,no,no,no,no,no,no,,no,no,no,no,no,no,s�,mensual,1,no,no,no,no,no,,s� y lo encontraron alto,s�,no,no,no,s� y los encontraron altos,no,no,,no,,no,,no,,s�,70,no,,,,,,,,,,,,,,,,,,,,,,,,,,,,,,,,,,,,,,,,,,,,,,,,,,,,,,,,,,,,,,,,,,,,,,,,,,,,,,,,,,,,,,,,,,,,,,,,,,,,,,,,,,,,,,,,,,,,,,,,,,,,,,,,,,,,,,,,,,,,,,,,,,,,,,,,,,,,,,,,,,,,,,no tiene cartilla,,,no,,no,no,,,no,,,,,,no,,,,,,s�,seguro social (imss),,negativo,,,no,,,,,,,,,,,,,,,,,,,,,,,,s�,no,s�,s�,0,1,seguro social (imss),,no,negativo,,,no,,,,,,,,,,,,s�,no,s�,s�,0,1,seguro social (imss),,no,negativo,,,no,,,,,,,,,,,,no,,,,,,,,,,,,,,,,,,,,,,no,,,,,,,,,,,,,,,,,,,,,,,,nunca he fumado,,,,,,25,actualmente no toma,nunca,M0101," baja marginalidad + [ metropolitano en  edo<>df | mpios 3,4",metropolitano,baja marginalidad,482.79825,15,,,
010007,1,01,1,001,0001,hombre,43,hombre,43,,no presenta los problemas 1 y 2,,,,,,,,,,,,,,,,,,,,,,,,,,,,,,,,,,,,,,,,,,,,no,,k,,j,,rara vez o nunca (menos de un d�a),pocas veces o alguna vez (1 - 2 d�as),rara vez o nunca (menos de un d�a),rara vez o nunca (menos de un d�a),todo el tiempo o la mayor�a del tiempo (5 - 7 d�as),todo el tiempo o la mayor�a del tiempo (5 - 7 d�as),rara vez o nunca (menos de un d�a),,,no,,,no,,,,,,,,,,,,,,,,,,,,,,,,,,,,,,,,,,,,,,,,,,,,,,,,,,,,,,,,,,s�,menos de un mes,2,,,no,,,,,,,,,,,,,,,,,,,,,ns/nr,99,no,s�,no,no,no,,s� y lo encontraron alto,no,no,no,s�,s� y los encontraron normales,no,no,,s�,58,s�,45,no,,no,,no,,16,no,no,no,no,no,no,no,no,no,no,no,no,no,s�,no,,no,no,no,no,no,no,no,no,no,no,no,no,s�,no,no,,,,,,,,,,,,,,,,,,,,,,,,,,,,,,,,,,,,,,,,,,,,,,,,,,,,,,,,,,,,,,,,,,,,,,s�,12,no,s�,no,no,no,no,no,no,no,no,no,no,no,no,no,no,no,,no,no,no,no,no,,no,,,ayuda a prevenir algunas malformaciones al nacimiento (malfo,,,,,,,,,,,,,,,,,,,,,,,,,,,,no tiene cartilla,,"si, dice haberse aplicado la vacuna",2,"si, dice haberse aplicado la vacuna",2,,,,,,,no,,,no,,,,,,s�,issste,,positivo,s�,,s�,issste,,negativo,,,s�,issste,,negativo,,,,,,,,,no,,,,,,no,,,,,,,,,,,,,,,,,,,,,,,,,,,,,,,,,,,,,,,,,,,,,,,,,,,,,,no,,,,,,,,,,,,,,,,,,,,,,no,,,,,,,,,,,,,,,,,,,,,,,,nunca he fumado,,,,,,18,una vez al a�o,nunca,M0101," baja marginalidad + [ metropolitano en  edo<>df | mpios 3,4",metropolitano,baja marginalidad,362.53824,15,,,
010007,2,01,1,001,0001,mujer,44,mujer,44,,no presenta los problemas 1 y 2,,,,,,,,,,,,,,,,,,,,,,,,,,,,,,,,,,,,,,,,,,,,s�,s�,,e,,c,rara vez o nunca (menos de un d�a),rara vez o nunca (menos de un d�a),rara vez o nunca (menos de un d�a),rara vez o nunca (menos de un d�a),rara vez o nunca (menos de un d�a),todo el tiempo o la mayor�a del tiempo (5 - 7 d�as),rara vez o nunca (menos de un d�a),,,no,,,no,,,,,,,,,,,,,,,,,,,,,,,,,,,,,,,,,,,,,,,,,,,,,,,,,,,,,,,,,,no,,,,,,,,,,,,,,,,,,,,,,,,,,,,no,no,no,no,no,,no,,,,,no,no,s�,55,no,,no,,no,,s�,50,no,,20,no,no,no,no,no,no,no,no,no,no,s�,no,no,no,no,,no,no,no,no,no,no,no,s�,no,no,no,no,no,no,no,,no,,,,,,,,menos de un mes,menos de un mes,,,s�,no,4,4,0,0,0,25/01/2007,20,m�dico,issste,,4,s�,s�,s�,s�,s�,s�,no,no,s�,s�,s�,s�,no,no,s�,no,no,no,s�,no,no,no,m�dico,issste,,s�,no,no,no,s�,no,no,no,no,ces�rea por urgencia?,2.7,"del recuerdo de su  mam�, cuidadora o informante",de tama�o normal?,meses,1,s�,"operaci�n femenina, otb o ligadura de trompas",,no,,,,,,,,,,,,,,,,,,,,no,no,no,no,no,,no,,,ns/nr,,no,,no,,,,,,,,,,,,,,,,,,,,,,,,"s�, pero no la mostr�",,no,,"si, dice haberse aplicado la vacuna",4,,,,,,,no,,,no,,,,,,no,,,,,,no,,,,,,no,,,,,,s�,issste,,negativo,,,,,,,,,,,,,,,s�,no,s�,s�,9,0,centro de salud u hospital de la ssa,,no,negativo,,,no,,,,,,,,,,,,no,,,,,,,,,,,,no,,,,,,,,,,,,no,,,,,,,,,,,,,,,,,,,,,,no,,,,,,,,,,,,,,,,,,,,,,,,nunca he fumado,,,,,,19,aproximadamente una vez al mes,nunca,M0101," baja marginalidad + [ metropolitano en  edo<>df | mpios 3,4",metropolitano,baja marginalidad,284.12976,15,2007,1,IS Públicas/Privadas
010008,1,01,1,001,0001,mujer,36,mujer,36,,no presenta los problemas 1 y 2,,,,,,,,,,,,,,,,,,,,,,,,,,,,,,,,,,,,,,,,,,,,no,,,d,,d,rara vez o nunca (menos de un d�a),un n�mero de veces considerable (3 - 4 d�as),rara vez o nunca (menos de un d�a),rara vez o nunca (menos de un d�a),rara vez o nunca (menos de un d�a),un n�mero de veces considerable (3 - 4 d�as),rara vez o nunca (menos de un d�a),,,no,,,no,,,,,,,,,,,,,,,,,,,,,,,,,,,,,,,,,,,,,,,,,,,,,,,,,,,,,,,,,,no,,,,,,,,,,,,,,,,,,,,,,,,,,,,no,no,no,no,no,,no,,,,,no,no,no,,s�,ns/nr,no,,s�,36,no,,no,,16,no,no,no,no,no,no,no,no,no,no,no,no,s�,no,no,,no,no,no,s�,no,no,no,no,no,no,no,no,no,no,no,,no,,,,,,,,menos de un mes,menos de un mes,,,s�,no,4,4,0,0,0,25/09/2007,4,m�dico,seguro social (imss),,3,s�,s�,s�,s�,s�,s�,s�,s�,s�,s�,s�,s�,no,no,no,no,no,no,s�,no,no,no,m�dico,seguro social (imss),,no,,,,,,,,,ces�rea programada?,3,de la cartilla del ni�o o de otro documento,de tama�o normal?,meses,6,s�,inyecciones,,no,,,,,,,,,,,,,,,,,,,,no,no,no,no,no,,no,,,ayuda a prevenir algunas malformaciones al nacimiento (malfo,,s�,,no,,,,,,,,,,,,,,,,,,,,,,,,no tiene cartilla,,no,,"si, dice haberse aplicado la vacuna",4,,,,,,,no,,,no,,,,,,no,,,,,,s�,seguro social (imss),,negativo,,,s�,seguro social (imss),,negativo,,,no,,,,,,,,,,,,,,,,,,s�,s�,s�,s�,6,0,seguro social (imss),,no,negativo,,,no,,,,,,,,,,,,no,,,,,,,,,,,,no,,,,,,,,,,,,no,,,,,,,,,,,,,,,,,,,,,,no,,,,,,,,,,,,,,,,,,,,,,,,nunca he fumado,,,,,,nunca ha tomado,,,M0101," baja marginalidad + [ metropolitano en  edo<>df | mpios 3,4",metropolitano,baja marginalidad,284.12976,15,2007,1,IS Públicas/Privadas
010009,1,01,1,001,0001,mujer,91,mujer,91,,no presenta los problemas 1 y 2,no,correcto,correcto,correcto,10,no presenta alguno de los problemas anteriores y se neg� a h,,,,correcto,incorrecto,correcto,si la suma es 1 o m�s,,,no,buena,no,regular,s�,insatisfecho(a),satisfecho(a),insatisfecho(a),satisfecho(a),satisfecho(a),satisfecho(a),satisfecho(a),s�,s�,no,s�,s�,s�,s�,s�,no lo hace,no lo hace,s�,no,si,ha comido menos,1,1,no,,,c,,c,todo el tiempo o la mayor�a del tiempo (5 - 7 d�as),rara vez o nunca (menos de un d�a),todo el tiempo o la mayor�a del tiempo (5 - 7 d�as),todo el tiempo o la mayor�a del tiempo (5 - 7 d�as),todo el tiempo o la mayor�a del tiempo (5 - 7 d�as),pocas veces o alguna vez (1 - 2 d�as),todo el tiempo o la mayor�a del tiempo (5 - 7 d�as),,,no,,,no,,,,,,,,,,,,,,,,,,,,,,,,,,,,,,,,,,,,,,,,,,,,,,,,,,,,,,,,,,no,,,,,,,,,,,,,,,,,,,,,,,,,,,,s�,no,no,no,no,,s� y lo encontraron normal,,,,,s� y los encontraron normales,no,no,,no,,no,,no,,no,,no,,,,,,,,,,,,,,,,,,,,,,,,,,,,,,,,,,,,,,,,,,,,,,,,,,,,,,,,,,,,,,,,,,,,,,,,,,,,,,,,,,,,,,,,,,,,,,,,,,,,,,,,,,,,,,,,,,,,,,,,,,,,,,,,,,,,,,,,,,,,,,,,,,,,,,,,,,,,,,,,,,,,,,no tiene cartilla,,no,no,,no,no,,,no,,,,,,no,,,,,,no,,,,,,no,,,,,,no,,,,,,,,,,,,,,,,,,s�,no,no,no,0,6,,,,,,,no,,,,,,,,,,,,no,,,,,,,,,,,,no,,,,,,,,,,,,s�,ca�da a nivel de piso,,,hogar,ninguna lesi�n en esta regi�n,ninguna lesi�n en esta regi�n,fractura,ninguna lesi�n en esta regi�n,ninguna lesi�n en esta regi�n,ninguna lesi�n en esta regi�n,ninguna lesi�n en esta regi�n,ninguna lesi�n en esta regi�n,ninguna lesi�n en esta regi�n,ninguna lesi�n en esta regi�n,,m�dico especialista,,no estaba bajo efectos de alcohol o drogas,,limitaci�n o dificultad para moverse o caminar (o lo hace co,,no,,,,,,,,,,,,,,,,,,,,,,,,nunca he fumado,,,,,,nunca ha tomado,,,M0101," baja marginalidad + [ metropolitano en  edo<>df | mpios 3,4",metropolitano,baja marginalidad,679.15417,15,,,
010010,2,01,1,001,0001,mujer,75,mujer,75,,no presenta los problemas 1 y 2,"s�, de intensidad ligera/moderada o infrecuente",correcto,correcto,correcto,10,no presenta alguno de los problemas anteriores y se neg� a h,,,,correcto,incorrecto,correcto,si la suma es 1 o m�s,,,no,buena,no,buena,s�,satisfecho(a),satisfecho(a),satisfecho(a),satisfecho(a),insatisfecho(a),satisfecho(a),satisfecho(a),s�,s�,s�,no,no,no,no,,no,no,no,no,,ha comido igual,ninguna,,no,,,b,,c,rara vez o nunca (menos de un d�a),rara vez o nunca (menos de un d�a),rara vez o nunca (menos de un d�a),rara vez o nunca (menos de un d�a),rara vez o nunca (menos de un d�a),todo el tiempo o la mayor�a del tiempo (5 - 7 d�as),rara vez o nunca (menos de un d�a),,,no,,,no,,,,,,,,,,,,,,,,,,,,,,,,,,,,,,,,,,,,,,,,,,,,,,,,,,,,,,,,,,no,,,,,,,,,,,,,,,,,,,,,,,,,,,,no,no,no,s�,no,,s� y lo encontraron normal,,,,,s� y los encontraron normales,no,no,,s�,80,no,,no,,no,,s�,35,,,,,,,,,,,,,,,,,,,,,,,,,,,,,,,,,,,,,,,,,,,,,,,,,,,,,,,,,,,,,,,,,,,,,,,,,,,,,,,,,,,,,,,,,,,,,,,,,,,,,,,,,,,,,,,,,,,,,,,,,,,,,,,,,,,,,,,,,,,,,,,,,,,,,,,,,,,,,,,,,,,,,no tiene cartilla,,no,no,,no,no,,,no,,,,,,no,,,,,,s�,seguro social (imss),,negativo,,,s�,seguro social (imss),,negativo,,,s�,seguro social (imss),,negativo,,,,,,,,,,,,,,,s�,no,s�,no,0,1,m�dico privado,,no,negativo,,,no,,,,,,,,,,,,s�,no,s�,no,0,1,m�dico privado,,no,negativo,,,no,,,,,,,,,,,,no,,,,,,,,,,,,,,,,,,,,,,no,,,,,,,,,,,,,,,,,,,,,,,,nunca he fumado,,,,,,ns/nr,,,M0101," baja marginalidad + [ metropolitano en  edo<>df | mpios 3,4",metropolitano,baja marginalidad,1358.3083,15,,,
010012,2,01,1,001,0001,mujer,37,mujer,37,,no presenta los problemas 1 y 2,,,,,,,,,,,,,,,,,,,,,,,,,,,,,,,,,,,,,,,,,,,,s�,s�,,g,,e,rara vez o nunca (menos de un d�a),rara vez o nunca (menos de un d�a),rara vez o nunca (menos de un d�a),rara vez o nunca (menos de un d�a),rara vez o nunca (menos de un d�a),pocas veces o alguna vez (1 - 2 d�as),rara vez o nunca (menos de un d�a),,,no,,,no,,,,,,,,,,,,,,,,,,,,,,,,,,,,,,,,,,,,,,,,,,,,,,,,,,,,,,,,,,no,,,,,,,,,,,,,,,,,,,,,,,,,,,,no,no,no,no,no,,no,,,,,no,no,no,,no,,no,,no,,s�,49,no,,25,no,no,no,no,no,no,no,no,no,no,no,no,s�,no,no,,no,s�,no,no,no,no,no,no,no,no,no,no,no,no,no,,no,,,,,,,,1,0,,,s�,no,2,2,0,0,0,24/05/2004,,,,,,,,,,,,,,,,,,,,,,,,,,,,,,,,,,,,,,,,normal (vaginal)?,3.5,de la cartilla del ni�o o de otro documento,de tama�o normal?,meses,1,s�,inyecciones,,no,,,,,,,,,,,,,,,,,,,,no,no,no,no,no,,no,,,ayuda a prevenir algunas malformaciones al nacimiento (malfo,,no,,no,,,,,,,,,,,,,,,,,,,,,,,,no tiene cartilla,,no,,"si, dice haberse aplicado la vacuna",1,,,,,,,no,,,no,,,,,,s�,centro de salud u hospital de la ssa,,positivo,no,es caro,no,,,,,,s�,centro de salud u hospital de la ssa,,negativo,,,s�,centro de salud u hospital de la ssa,,negativo,,,,,,,,,,,,,,,s�,no,s�,s�,0,1,centro de salud u hospital de la ssa,,no,negativo,,,no,,,,,,,,,,,,s�,no,s�,no,0,1,centro de salud u hospital de la ssa,,no,negativo,,,no,,,,,,,,,,,,no,,,,,,,,,,,,,,,,,,,,,,no,,,,,,,,,,,,,,,,,,,,,,,,nunca he fumado,,,,,,nunca ha tomado,,,M0101," baja marginalidad + [ metropolitano en  edo<>df | mpios 3,4",metropolitano,baja marginalidad,568.25952,15,2004,1,
010014,1,01,1,001,0001,mujer,26,mujer,26,,no presenta los problemas 1 y 2,,,,,,,,,,,,,,,,,,,,,,,,,,,,,,,,,,,,,,,,,,,,no,,,d,,b,todo el tiempo o la mayor�a del tiempo (5 - 7 d�as),todo el tiempo o la mayor�a del tiempo (5 - 7 d�as),todo el tiempo o la mayor�a del tiempo (5 - 7 d�as),todo el tiempo o la mayor�a del tiempo (5 - 7 d�as),rara vez o nunca (menos de un d�a),pocas veces o alguna vez (1 - 2 d�as),todo el tiempo o la mayor�a del tiempo (5 - 7 d�as),,,s�,s�,no,no,,,,,,,,,,,,,,,,,,,,,,,,,,,,,,,,,,,,,,,,,,,,,,,,,,,,,,,,,,no,,,,,,,,,,,,,,,,,,,,,,,,,,,,no,no,no,no,no,,s� y lo encontraron normal,,,,,s� y los encontraron normales,no,no,,no,,no,,s�,60,s�,55,no,,22,no,s�,no,no,no,no,no,no,no,no,no,no,no,no,no,,no,no,no,no,s�,no,no,no,no,no,no,no,no,no,no,,no,,,,,,,,menos de un mes,menos de un mes,,,s�,no,1,1,0,0,0,30/11/2008,15,m�dico,seguro social (imss),,1,s�,s�,s�,s�,s�,s�,ns/nr,s�,no,s�,s�,s�,no,s�,s�,no,no,no,s�,no,no,no,m�dico,seguro social (imss),,no,,,,,,,,,normal (vaginal)?,2,de la cartilla del ni�o o de otro documento,m�s peque�o(a) de lo normal?,meses,8,no,,,no,,,,,,,,,,,,,,,,,,,,no,no,no,no,no,,s�,no,,ayuda a prevenir algunas malformaciones al nacimiento (malfo,,no,1,no,,,,,,,,,,,,,,,,,,,,,,,,"s�, pero no la mostr�",,no,,"si, dice haberse aplicado la vacuna",1,,,,,,,no,,,no,,,,,,s�,seguro social (imss),,positivo,no,no requiri� tratamiento,no,,,,,,no,,,,,,no,,,,,,,,,,,,,,,,,,s�,s�,no,no,4,0,seguro social (imss),,no,positivo,no,otro,no,,,,,,,,,,,,s�,s�,s�,no,4,0,seguro social (imss),,no,negativo,,,no,,,,,,,,,,,,no,,,,,,,,,,,,,,,,,,,,,,no,,,,,,,,,,,,,,,,,,,,,,,,s�,13,actualmente no fuma,88,,,13,aproximadamente una vez al mes,una vez al mes,M0101," baja marginalidad + [ metropolitano en  edo<>df | mpios 3,4",metropolitano,baja marginalidad,357.22693,15,2008,1,IS Públicas/Privadas
010015,1,01,1,001,0001,hombre,35,hombre,35,,no presenta los problemas 1 y 2,,,,,,,,,,,,,,,,,,,,,,,,,,,,,,,,,,,,,,,,,,,,s�,s�,n,,l,,rara vez o nunca (menos de un d�a),rara vez o nunca (menos de un d�a),rara vez o nunca (menos de un d�a),rara vez o nunca (menos de un d�a),rara vez o nunca (menos de un d�a),todo el tiempo o la mayor�a del tiempo (5 - 7 d�as),rara vez o nunca (menos de un d�a),,,no,,,no,,,,,,,,,,,,,,,,,,,,,,,,,,,,,,,,,,,,,,,,,,,,,,,,,,,,,,,,,,no,,,,,,,,,,,,,,,,,,,,,,,,,,,,no,no,no,no,no,,no,,,,,s� y los encontraron normales,no,s�,54,no,,no,,no,,no,,no,,15,no,no,no,no,no,no,no,no,no,no,no,no,s�,no,no,,no,no,no,no,s�,no,no,no,no,no,no,no,no,no,no,,s�,no,no,s�,no,no,no,,,,,,,,,,,,,,,,,,,,,,,,,,,,,,,,,,,,,,,,,,,,,,,,,,,,,,,,,,,,,,s�,6,no,no,no,no,no,no,no,no,no,no,no,no,s�,no,no,no,no,,no,no,no,no,no,,s�,s�,s�,ayuda a prevenir algunas malformaciones al nacimiento (malfo,,,,,,,,,,,,,,,,,,,,,,,,,,,,no tiene cartilla,,no,,"si, dice haberse aplicado la vacuna",3,,,,,,,no,,,no,,,,,,s�,seguro social (imss),,positivo,no,no requiri� tratamiento,s�,m�dico privado,,negativo,,,s�,centro de salud u hospital de la ssa,,negativo,,,s�,centro de salud u hospital de la ssa,,negativo,,,no,,,,,,no,,,,,,,,,,,,,,,,,,,,,,,,,,,,,,,,,,,,,,,,,,,,,,,,,,,,,,no,,,,,,,,,,,,,,,,,,,,,,no,,,,,,,,,,,,,,,,,,,,,,,,s�,16,ocasional,20,m�s de 1 hora,siempre,17,actualmente no toma,nunca,M0101," baja marginalidad + [ metropolitano en  edo<>df | mpios 3,4",metropolitano,baja marginalidad,725.07648,15,,,
010017,4,01,1,001,0001,hombre,21,hombre,21,,no presenta los problemas 1 y 2,,,,,,,,,,,,,,,,,,,,,,,,,,,,,,,,,,,,,,,,,,,,no,,l,,k,,rara vez o nunca (menos de un d�a),rara vez o nunca (menos de un d�a),rara vez o nunca (menos de un d�a),pocas veces o alguna vez (1 - 2 d�as),rara vez o nunca (menos de un d�a),todo el tiempo o la mayor�a del tiempo (5 - 7 d�as),rara vez o nunca (menos de un d�a),,,no,,,no,,,,,,,,,,,,,,,,,,,,,,,,,,,,,,,,,,,,,,,,,,,,,,,,,,,,,,,,,,no,,,,,,,,,,,,,,,,,,,,,,,,,,,,no,no,no,no,no,,no,,,,,no,no,no,,s�,40,s�,52,no,,no,,no,,15,s�,no,no,no,no,no,no,no,no,no,no,no,no,no,no,,s�,no,no,no,no,no,no,no,no,no,no,no,no,no,no,,,no,s�,s�,no,no,no,,,,,,,,,,,,,,,,,,,,,,,,,,,,,,,,,,,,,,,,,,,,,,,,,,,,,,,,,,,,,,s�,20,no,no,no,no,no,no,s�,no,no,no,no,no,no,no,no,no,no,,no,no,no,no,no,,no,,,ns/nr,,,3,,,,,,,,,,,,,,,,,,,,,,,,,"s�, pero no la mostr�",,no,,no,,,,,,,,no,,,no,,,,,,s�,otro lugar,EN UN CENTRO COMERCIAL,negativo,,,no,,,,,,no,,,,,,no,,,,,,no,,,,,,no,,,,,,,,,,,,,,,,,,,,,,,,,,,,,,,,,,,,,,,,,,,,,,,,,,,,,,no,,,,,,,,,,,,,,,,,,,,,,no,,,,,,,,,,,,,,,,,,,,,,,,s�,18,diario,5,entre 31 y 60 minutos,siempre,18,actualmente no toma,nunca,M0101," baja marginalidad + [ metropolitano en  edo<>df | mpios 3,4",metropolitano,baja marginalidad,1519.6123,15,,,