folio,intp,entidad,munici,locali,sexo,edad,dsexo,dedad,dedadns,d001,d002,d003,d102,d101a,d101b,d103,d104,d108,d109,d110a,d110b,d201,d202a,d202b,d202c,d202d,d202e,d202f,d202g,d202h,d202i,d202j,d202k,d202l,d202esp,d203,d203esp,d204,d205,d205esp,d206,d207,d208a,d208b,d208c,d208d,d208e,d208f,d208g,d208h,d208i,d208j,d208k,d208l,d208m,d208n,d208o,d208esp,d209,d210a,d210b,d210c,d210d,d210e,d210f,d210g,d210h,d210i,d210j,d210k,d210l,d210m,d210n,d210o,d210esp,d210_a,d210_ba,d210_bb,d210_bc,d210_bd,d210_be,d210_bf,d210besp,d212,d212a,d213,d214_1,d214_2,d214_3,d214_4,d215,d217,d218,d219,d219esp,d220,d221a,d221b,d221c,d221d,d221e,d221f,d221g,d221h,d221i,d221j,d221k,d221l,d222a,d222b,d222c,d222d,d222e,d222f,d222g,d222h,d222i,d222j,d223,d224,d224esp,d225,d226a,d226b,d226c,d226d,d226e,d226f,d226g,d226h,d231,d228a,d228a1,d238,d228ba,d228bb,d232,d232a,d232aesp,d233b,d233c,d233da,d233db,d233dc,d233dd,d233de,d233df,d233dg,d233dh,d233di,d233dj,d233dk,d233dl,d233dm,d233dn,d233do,d233dp,d233dq,d233desp,d233_1,d233_2,d233_3,d233_4,d233_5,d233_5sp,d236,d235,d235a,d236a,d236aesp,d236c,d234,d2a14a,d2a14b,d2a14b_1a,d2a14b_1b,d2a14c,d2a14c_1,d2a14d,d2a14ea,d2a14eb,d2a14fa,d2a14fb,d2a14fc,d2a14fd,d2a14fe,d2a14ff,d2a14fg,d2a14fh,d2a14fi,d2a14fj,d2a14fk,d2a14fl,d2a14fm,d2a14fn,d2a14fes,d301a,d301b,d301c,d301d,d310a,d310b,d311,d312a,d312b,d313,d314a,d314b,d315,d401a,d401b,d401c,d401d,d401e,d401f,d401g,d401h,d501,d502,d502a,d502b,d503,d504a,d504b,d504c,d504d,d504e,d504f,d504h,d504i,d504j,d504l,d504lesp,d505,d505esp,d506,d506esp,d507,d507esp,d601,d602a,d602b,d602c,d602d,d602e,d602f,d602g,d602h,d602i,d602j,d602k,d602l,d602esp,d603,d603esp,d604,d604esp,d606,d606esp,d607,d607esp,d608,d608esp,d701,d702a,d702b,d702c,d702d,d702e,d702f,d702g,d702h,d702i,d702j,d702k,d702l,d702m,d702esp,d703,d801,d802a,d802b,d803,d804a,d804b,d804c,d804d,d804e,d804f,d805,d806a,d806b,d807,d808a,d808b,d808c,d808d,d808e,d808f,d808g,d809,d810a,d810b,d810c,d810d,d811,code_upm,est_dis,est_urb,est_marg,pondef,est_var
010001,3,01,001,0001,hombre,19,hombre,19,,s�,s�,no,19,actualmente no fuma,88,,,15,una o dos veces a la semana,1 a 2 veces a la semana,,si,s�,s�,no,no,s�,s�,no,no,no,no,no,no,,una sola vez,,para ambos,en tomar una o varias pastillas anticonceptivas lo m�s pront,,16,14,no,no,no,no,no,no,no,no,no,no,no,no,s�,no,no,,s�,no,no,no,no,no,no,no,no,no,no,no,no,s�,no,no,,,,,,,,,,,,,,,,,,,,,,,,,,,,,,,,,,,,,,,,,,,,,,,,,,,,,,,,,,,,,,,,,,s�,6,no,no,no,no,no,no,s�,no,no,no,no,no,no,no,no,no,no,,no,no,no,no,no,,no,,,ayuda a prevenir algunas malformaciones al nacimiento (malfo,,,1,,,,,,,,,,,,,,,,,,,,,,,,,no,,,,"s�, dice haberse aplicado la vacuna",,1,"s�, dice haberse aplicado la vacuna",,1,"s�, dice haberse aplicado la vacuna",,1,nunca o casi nunca,nunca o casi nunca,nunca o casi nunca,nunca o casi nunca,nunca o casi nunca,nunca o casi nunca,nunca o casi nunca,nunca o casi nunca,no,,,,,,,,,,,,,,,,,,,,,,no,,,,,,,,,,,,,,,,,,,,,,,,"no, nunca",,,,,,,,,,,,,,,,no,,,,,,,,,,no,,,,,,,,,,,no,,,,,no,M0101," baja marginalidad + [ metropolitano en  edo<>df | mpios 3,4",metropolitano,baja marginalidad,673.4657,15
010008,3,01,001,0001,hombre,14,hombre,14,,s�,s�,nunca ha fumado,,,,,,nunca ha tomado,,,,no,,,,,,,,,,,,,,,,,,,no ha tenido relaciones sexuales,,,,,,,,,,,,,,,,,,,,,,,,,,,,,,,,,,,,,,,,,,,,,,,,,,,,,,,,,,,,,,,,,,,,,,,,,,,,,,,,,,,,,,,,,,,,,,,,,,,no,,,,,,,,,,,,,,,,,,,,no,no,no,no,no,,no,,,ns/nr,,,,,,,,,,,,,,,,,,,,,,,,,,,,no,,,,"s�, dice haberse aplicado la vacuna",,1,"s�, dice haberse aplicado la vacuna",,1,"s�, dice haberse aplicado la vacuna",,1,a veces,a veces,a veces,nunca o casi nunca,a veces,a veces,con mucha frecuencia m�s de 2 veces en una semana,nunca o casi nunca,no,,,,,,,,,,,,,,,,,,,,,,no,,,,,,,,,,,,,,,,,,,,,,,,"no, nunca",,,,,,,,,,,,,,,,no,,,,,,,,,,no,,,,,,,,,,,no,,,,,no,M0101," baja marginalidad + [ metropolitano en  edo<>df | mpios 3,4",metropolitano,baja marginalidad,831.03772,15
010011,4,01,001,0001,hombre,11,hombre,10,,s�,s�,nunca ha fumado,,,,,,nunca ha tomado,,,,,,,,,,,,,,,,,,,,,,,,,,,,,,,,,,,,,,,,,,,,,,,,,,,,,,,,,,,,,,,,,,,,,,,,,,,,,,,,,,,,,,,,,,,,,,,,,,,,,,,,,,,,,,,,,,,,,,,,,,,,,,,,,,,,,,,,,,,,,,,,,,,,,,,,,,,,,,,,,,,,,,,,,,,,,,,,,,,si la(s) tiene pero no la(s) mostr�,,,,,,,,,,,,,a veces,a veces,nunca o casi nunca,nunca o casi nunca,nunca o casi nunca,nunca o casi nunca,nunca o casi nunca,nunca o casi nunca,no,,,,,,,,,,,,,,,,,,,,,,no,,,,,,,,,,,,,,,,,,,,,,,,"no, nunca",,,,,,,,,,,,,,,,no,,,,,,,,,,no,,,,,,,,,,,no,,,,,no,M0101," baja marginalidad + [ metropolitano en  edo<>df | mpios 3,4",metropolitano,baja marginalidad,415.51886,15
010015,5,01,001,0001,mujer,12,mujer,12,,s�,s�,nunca ha fumado,,,,,,11,actualmente no toma,,nunca,si,s�,no,no,no,no,no,no,no,no,no,no,no,,una sola vez,,para prevenir una infecci�n de transmisi�n sexual,,,no ha tenido relaciones sexuales,,,,,,,,,,,,,,,,,,,,,,,,,,,,,,,,,,,,,,,,,,,,,,,,,,,,,,,,,,,,,,,,,,,,,,,,,,,,,,,,,,,,,,,,,,,,,,,,,,,no,,,,,,,,,,,,,,,,,,,,no,no,no,no,no,,no,,,ayuda a prevenir algunas malformaciones al nacimiento (malfo,,no,,,,,,,,,,,,,,,,,,,,,,,,,,si la(s) tiene pero no la(s) mostr�,,,,no,,,"s�, dice haberse aplicado la vacuna",,3,no,,,nunca o casi nunca,a veces,nunca o casi nunca,nunca o casi nunca,nunca o casi nunca,nunca o casi nunca,nunca o casi nunca,nunca o casi nunca,no,,,,,,,,,,,,,,,,,,,,,,no,,,,,,,,,,,,,,,,,,,,,,,,"no, nunca",,,,,,,,,,,,,,,,no,,,,,,,,,,no,,,,,,,,,,,no,,,,,no,M0101," baja marginalidad + [ metropolitano en  edo<>df | mpios 3,4",metropolitano,baja marginalidad,967.14374,15
010021,4,01,001,0001,mujer,11,mujer,11,,s�,s�,nunca ha fumado,,,,,,nunca ha tomado,,,,,,,,,,,,,,,,,,,,,,,,,,,,,,,,,,,,,,,,,,,,,,,,,,,,,,,,,,,,,,,,,,,,,,,,,,,,,,,,,,,,,,,,,,,,,,,,,,,,,,,,,,,,,,,,,,,,,,,,,,,,,,,,,,,,,,,,,,,,,,,,,,,,,,,,,,,,,,,,,,,,,,,,,,,,,,,,,,,si la(s) tiene pero no la(s) mostr�,,,,,,,,,,,,,con mucha frecuencia m�s de 2 veces en una semana,nunca o casi nunca,nunca o casi nunca,nunca o casi nunca,a veces,a veces,a veces,nunca o casi nunca,no,,,,,,,,,,,,,,,,,,,,,,no,,,,,,,,,,,,,,,,,,,,,,,,"no, nunca",,,,,,,,,,,,,,,,no,,,,,,,,,,no,,,,,,,,,,,no,,,,,no,M0101," baja marginalidad + [ metropolitano en  edo<>df | mpios 3,4",metropolitano,baja marginalidad,721.76849,15
010022,5,01,001,0001,mujer,16,mujer,16,,s�,s�,nunca ha fumado,,,,,,14,actualmente no toma,,nunca,si,s�,s�,no,no,no,no,no,no,no,no,no,no,,una sola vez,,para ambos,ns/nr,,no ha tenido relaciones sexuales,,,,,,,,,,,,,,,,,,,,,,,,,,,,,,,,,,,,,,,,,,,,,,,,,,,,,,,,,,,,,,,,,,,,,,,,,,,,,,,,,,,,,,,,,,,,,,,,,,,no,,,,,,,,,,,,,,,,,,,,no,no,no,no,no,,no,,,ayuda a prevenir algunas malformaciones al nacimiento (malfo,,no,,,,,,,,,,,,,,,,,,,,,,,,,,no,,,,no,,,no,,,no,,,nunca o casi nunca,nunca o casi nunca,nunca o casi nunca,nunca o casi nunca,nunca o casi nunca,nunca o casi nunca,nunca o casi nunca,nunca o casi nunca,no,,,,,,,,,,,,,,,,,,,,,,no,,,,,,,,,,,,,,,,,,,,,,,,"no, nunca",,,,,,,,,,,,,,,,no,,,,,,,,,,no,,,,,,,,,,,no,,,,,no,M0101," baja marginalidad + [ metropolitano en  edo<>df | mpios 3,4",metropolitano,baja marginalidad,343.70218,15
010023,4,01,001,0001,mujer,15,mujer,15,,s�,s�,nunca ha fumado,,,,,,14,actualmente no toma,,nunca,si,s�,no,no,s�,s�,s�,no,no,no,no,no,no,,una sola vez,,para ambos,,,13,17,s�,no,no,no,no,no,no,no,no,no,no,no,no,no,no,,s�,no,no,no,s�,no,no,no,no,no,no,no,no,no,no,no,,no,,,,,,,,s�,no,1,1,0,0,0,24/03/2011,6,m�dico,centro de salud u hospital de la ssa,,3,s�,s�,s�,s�,s�,s�,s�,s�,s�,s�,s�,s�,no,no,no,no,no,no,no,no,no,no,m�dico,centro de salud u hospital de la ssa,,no,,,,,,,,,ces�rea por urgencia?,2.5999999,"del recuerdo de la mam�, cuidadora o informante",de tama�o normal?,meses,8,s�,inyecciones,,s�,6,no,no,no,no,no,no,s�,no,no,no,no,no,no,no,no,no,no,,no,no,no,no,no,,s�,s�,s�,ayuda a prevenir algunas malformaciones al nacimiento (malfo,,s�,1,no,,,,,,,,,,,,,,,,,,,,,,,,no,,,,no,,,"s�, dice haberse aplicado la vacuna",,2,"s�, dice haberse aplicado la vacuna",,1,a veces,a veces,nunca o casi nunca,nunca o casi nunca,nunca o casi nunca,nunca o casi nunca,nunca o casi nunca,nunca o casi nunca,no,,,,,,,,,,,,,,,,,,,,,,no,,,,,,,,,,,,,,,,,,,,,,,,"no, nunca",,,,,,,,,,,,,,,,no,,,,,,,,,,no,,,,,,,,,,,no,,,,,no,M0101," baja marginalidad + [ metropolitano en  edo<>df | mpios 3,4",metropolitano,baja marginalidad,687.40436,15
010027,4,01,001,0001,hombre,19,hombre,19,,s�,s�,nunca ha fumado,,,,,,15,una o dos veces a la semana,nunca,,si,s�,s�,no,s�,no,no,no,no,no,no,no,no,,una sola vez,,para ambos,en tomar una o varias pastillas anticonceptivas lo m�s pront,,18,18,s�,no,no,no,no,no,no,no,no,no,no,no,no,no,no,,no,s�,no,no,no,no,no,no,no,no,no,no,no,no,no,no,,,no,s�,no,no,no,no,,,,,,,,,,,,,,,,,,,,,,,,,,,,,,,,,,,,,,,,,,,,,,,,,,,,,,,,,,no,,,,,,,,,,,,,,,,,,,,no,no,no,no,no,,no,,,ayuda a prevenir algunas malformaciones al nacimiento (malfo,,,1,,,,,,,,,,,,,,,,,,,,,,,,,si la(s) tiene pero no la(s) mostr�,,,,"s�, dice haberse aplicado la vacuna",,1,"s�, dice haberse aplicado la vacuna",,1,"s�, dice haberse aplicado la vacuna",,1,a veces,con frecuencia 2 veces en una semana,con frecuencia 2 veces en una semana,nunca o casi nunca,nunca o casi nunca,nunca o casi nunca,a veces,nunca o casi nunca,no,,,,,,,,,,,,,,,,,,,,,,no,,,,,,,,,,,,,,,,,,,,,,,,"no, nunca",,,,,,,,,,,,,,,,no,,,,,,,,,,no,,,,,,,,,,,no,,,,,no,M0101," baja marginalidad + [ metropolitano en  edo<>df | mpios 3,4",metropolitano,baja marginalidad,286.09116,15
010033,3,01,001,0001,mujer,18,mujer,18,,no,,s�,13,diario,20,entre 31 y 60 minutos,poco,13,dos o tres veces al mes,,2 a 3 veces al mes,si,s�,s�,s�,s�,s�,s�,no,no,no,no,no,no,,una sola vez,,para prevenir una infecci�n de transmisi�n sexual,en tomar una o varias pastillas anticonceptivas lo m�s pront,,15,19,s�,no,no,no,no,no,no,no,no,no,no,no,no,no,no,,s�,s�,no,s�,no,no,no,no,no,no,no,no,no,no,no,no,,,no,s�,no,no,no,no,,s�,no,1,1,0,0,0,22/04/2010,6,m�dico,centro de salud u hospital de la ssa,,4,s�,s�,s�,s�,s�,s�,s�,s�,s�,ns/nr,s�,s�,no,no,no,no,no,s�,s�,no,no,no,m�dico,centro de salud u hospital de la ssa,,no,,,,,,,,,normal (vaginal)?,2.8659999,"del recuerdo de la mam�, cuidadora o informante",de tama�o normal?,meses,5,no,,,s�,6,no,no,no,no,no,no,no,no,no,no,no,no,no,no,no,s�,no,TRABAJO,no,no,no,no,no,,ns/nr,,,ayuda a prevenir algunas malformaciones al nacimiento (malfo,,no,3,no,,,,,,,,,,,,,,,,,,,,,,,,si la(s) tiene pero no la(s) mostr�,,,,"s�, dice haberse aplicado la vacuna",,ns/nr,"s�, dice haberse aplicado la vacuna",,ns/nr,no,,,con mucha frecuencia m�s de 2 veces en una semana,a veces,a veces,nunca o casi nunca,con frecuencia 2 veces en una semana,con frecuencia 2 veces en una semana,con frecuencia 2 veces en una semana,nunca o casi nunca,s�,choque entre vehiculos de 4 o m�s ruedas,s�,,v�a p�blica,ninguna lesi�n en esta region,ninguna lesi�n en esta region,ninguna lesi�n en esta region,ninguna lesi�n en esta region,laceraci�n,ninguna lesi�n en esta region,ninguna lesi�n en esta region,ninguna lesi�n en esta region,ninguna lesi�n en esta region,ninguna lesi�n en esta region,,encargado de la comunidad/promotor/auxiliar de salud,,no estaba bajo efectos del alcohol o drogas,,ning�n problema,,no,,,,,,,,,,,,,,,,,,,,,,,,"s�, pero no en los �ltimos 12 meses",s�,no,no,no,no,no,no,no,no,s�,no,no,no,,no,no,,,,,,,,,,no,,,,,,,,,,,no,,,,,no,M0101," baja marginalidad + [ metropolitano en  edo<>df | mpios 3,4",metropolitano,baja marginalidad,967.14374,15
010034,7,01,001,0001,mujer,16,mujer,16,,no,,nunca ha fumado,,,,,,15,actualmente no toma,,nunca,si,s�,no,s�,no,no,s�,no,no,no,no,no,no,,una sola vez,,para ambos,,,no ha tenido relaciones sexuales,,,,,,,,,,,,,,,,,,,,,,,,,,,,,,,,,,,,,,,,,,,,,,,,,,,,,,,,,,,,,,,,,,,,,,,,,,,,,,,,,,,,,,,,,,,,,,,,,,,no,,,,,,,,,,,,,,,,,,,,no,no,no,no,no,,no,,,ayuda a prevenir algunas malformaciones al nacimiento (malfo,,no,,,,,,,,,,,,,,,,,,,,,,,,,,no,,,,no,,,"s�, dice haberse aplicado la vacuna",,1,no,,,con frecuencia 2 veces en una semana,con frecuencia 2 veces en una semana,a veces,nunca o casi nunca,nunca o casi nunca,nunca o casi nunca,nunca o casi nunca,nunca o casi nunca,no,,,,,,,,,,,,,,,,,,,,,,no,,,,,,,,,,,,,,,,,,,,,,,,"no, nunca",,,,,,,,,,,,,,,,no,,,,,,,,,,no,,,,,,,,,,,no,,,,,no,M0101," baja marginalidad + [ metropolitano en  edo<>df | mpios 3,4",metropolitano,baja marginalidad,292.01236,15
010035,4,01,001,0001,hombre,18,hombre,18,,no,,no,14,actualmente no fuma,88,,,16,aproximadamente una vez al mes,una vez al mes,,si,s�,no,no,no,no,no,no,no,no,no,no,no,,una sola vez,,para prevenir un embarazo,,,17,16,s�,no,no,no,no,no,no,no,no,no,no,no,no,no,no,,s�,s�,no,no,no,no,no,no,no,no,no,no,no,no,no,no,,,no,no,s�,no,no,no,,,,,,,,,,,,,,,,,,,,,,,,,,,,,,,,,,,,,,,,,,,,,,,,,,,,,,,,,,no,,,,,,,,,,,,,,,,,,,,no,no,no,no,no,,no,,,ns/nr,,,2,,,,,,,,,,,,,,,,,,,,,,,,,no,,,,no,,,no,,,no,,,con frecuencia 2 veces en una semana,nunca o casi nunca,a veces,nunca o casi nunca,nunca o casi nunca,nunca o casi nunca,nunca o casi nunca,nunca o casi nunca,no,,,,,,,,,,,,,,,,,,,,,,no,,,,,,,,,,,,,,,,,,,,,,,,"no, nunca",,,,,,,,,,,,,,,,no,,,,,,,,,,no,,,,,,,,,,,no,,,,,no,M0101," baja marginalidad + [ metropolitano en  edo<>df | mpios 3,4",metropolitano,baja marginalidad,336.73285,15
010036,3,01,001,0001,mujer,16,mujer,16,,s�,s�,nunca ha fumado,,,,,,entre los 13 y los 19 a�os,actualmente no toma,,nunca,si,s�,no,s�,s�,s�,no,no,no,no,no,no,no,,una sola vez,,para ambos,,,no ha tenido relaciones sexuales,,,,,,,,,,,,,,,,,,,,,,,,,,,,,,,,,,,,,,,,,,,,,,,,,,,,,,,,,,,,,,,,,,,,,,,,,,,,,,,,,,,,,,,,,,,,,,,,,,,no,,,,,,,,,,,,,,,,,,,,no,no,no,no,no,,no,,,ayuda a prevenir algunas malformaciones al nacimiento (malfo,,s�,,,,,,,,,,,,,,,,,,,,,,,,,,no,,,,"s�, dice haberse aplicado la vacuna",,ns/nr,"s�, dice haberse aplicado la vacuna",,1,"s�, dice haberse aplicado la vacuna",,ns/nr,nunca o casi nunca,nunca o casi nunca,nunca o casi nunca,nunca o casi nunca,nunca o casi nunca,nunca o casi nunca,nunca o casi nunca,nunca o casi nunca,no,,,,,,,,,,,,,,,,,,,,,,no,,,,,,,,,,,,,,,,,,,,,,,,"no, nunca",,,,,,,,,,,,,,,,no,,,,,,,,,,no,,,,,,,,,,,no,,,,,no,M0101," baja marginalidad + [ metropolitano en  edo<>df | mpios 3,4",metropolitano,baja marginalidad,292.01236,15
010036,4,01,001,0001,hombre,12,hombre,13,,s�,s�,nunca ha fumado,,,,,,nunca ha tomado,,,,si,s�,no,no,no,no,no,no,no,no,no,no,no,,una sola vez,,para ambos,,,no ha tenido relaciones sexuales,,,,,,,,,,,,,,,,,,,,,,,,,,,,,,,,,,,,,,,,,,,,,,,,,,,,,,,,,,,,,,,,,,,,,,,,,,,,,,,,,,,,,,,,,,,,,,,,,,,no,,,,,,,,,,,,,,,,,,,,no,no,no,no,no,,no,,,ayuda a prevenir algunas malformaciones al nacimiento (malfo,,,,,,,,,,,,,,,,,,,,,,,,,,,,si la(s) tiene pero no la(s) mostr�,,,,"s�, dice haberse aplicado la vacuna",,1,no,,,"s�, dice haberse aplicado la vacuna",,1,con frecuencia 2 veces en una semana,a veces,a veces,nunca o casi nunca,con frecuencia 2 veces en una semana,con frecuencia 2 veces en una semana,con frecuencia 2 veces en una semana,nunca o casi nunca,s�,caida a nivel de piso,,,v�a p�blica,ninguna lesi�n en esta region,ninguna lesi�n en esta region,ninguna lesi�n en esta region,ninguna lesi�n en esta region,ninguna lesi�n en esta region,ninguna lesi�n en esta region,laceraci�n,laceraci�n,ninguna lesi�n en esta region,ninguna lesi�n en esta region,,familiar,,no estaba bajo efectos del alcohol o drogas,,ning�n problema,,no,,,,,,,,,,,,,,,,,,,,,,,,"no, nunca",,,,,,,,,,,,,,,,no,,,,,,,,,,no,,,,,,,,,,,s� y lo encontraron alto,no,s�,no,no,no,M0101," baja marginalidad + [ metropolitano en  edo<>df | mpios 3,4",metropolitano,baja marginalidad,353.02844,15
010037,5,01,001,0001,mujer,18,mujer,18,,s�,s�,no,13,actualmente no fuma,88,,,15,aproximadamente una vez al mes,,una vez al mes,si,s�,no,s�,no,s�,no,no,no,no,s�,no,no,,una sola vez,,para ambos,,,16,18,s�,no,no,no,no,no,no,no,no,no,no,no,no,no,no,,no,no,s�,no,no,no,no,no,no,no,no,no,no,no,no,no,,no,,,,,,,,no,,,,,,,,,,,,,,,,,,,,,,,,,,,,,,,,,,,,,,,,,,,,,,,,,,,,,,,,s�,5,no,no,no,no,no,no,s�,no,no,no,no,no,no,no,no,no,no,,no,no,no,no,no,,no,,,ayuda a prevenir algunas malformaciones al nacimiento (malfo,,no,1,,,,,,,,,,,,,,,,,,,,,,,,,no,,,,no,,,no,,,"s�, dice haberse aplicado la vacuna",,1,a veces,nunca o casi nunca,nunca o casi nunca,nunca o casi nunca,nunca o casi nunca,nunca o casi nunca,a veces,nunca o casi nunca,no,,,,,,,,,,,,,,,,,,,,,,no,,,,,,,,,,,,,,,,,,,,,,,,"no, nunca",,,,,,,,,,,,,,,,no,,,,,,,,,,no,,,,,,,,,,,no,,,,,no,M0101," baja marginalidad + [ metropolitano en  edo<>df | mpios 3,4",metropolitano,baja marginalidad,343.70218,15
010049,3,01,001,0001,mujer,16,mujer,16,,s�,s�,nunca ha fumado,,,,,,15,actualmente no toma,,nunca,si,s�,no,s�,no,no,no,no,no,no,no,no,no,,una sola vez,,para ambos,,,no ha tenido relaciones sexuales,,,,,,,,,,,,,,,,,,,,,,,,,,,,,,,,,,,,,,,,,,,,,,,,,,,,,,,,,,,,,,,,,,,,,,,,,,,,,,,,,,,,,,,,,,,,,,,,,,,no,,,,,,,,,,,,,,,,,,,,no,no,no,no,no,,no,,,ayuda a prevenir algunas malformaciones al nacimiento (malfo,,no,,,,,,,,,,,,,,,,,,,,,,,,,,"s�, mostr� la cartilla nacional de vacunaci�n","s�, mostr� la cartilla de salud y citas m�dicas (adolescente",,,"s�, y est� registrado en la cartilla nacional de salud (adol",,2,"s�, y est� registrado en la cartilla nacional de salud (adol",,1,"s�, y est� registrado en la cartilla nacional de salud (adol",,1,con mucha frecuencia m�s de 2 veces en una semana,nunca o casi nunca,nunca o casi nunca,nunca o casi nunca,nunca o casi nunca,a veces,con frecuencia 2 veces en una semana,nunca o casi nunca,no,,,,,,,,,,,,,,,,,,,,,,no,,,,,,,,,,,,,,,,,,,,,,,,"no, nunca",,,,,,,,,,,,,,,,no,,,,,,,,,,no,,,,,,,,,,,no,,,,,no,M0102," baja marginalidad + [ metropolitano en  edo<>df | mpios 3,4",metropolitano,baja marginalidad,248.37027,15
010053,4,01,001,0001,mujer,15,mujer,15,,s�,s�,nunca ha fumado,,,,,,15,actualmente no toma,,nunca,si,s�,no,s�,no,s�,no,no,no,no,no,no,no,,una sola vez,,para ambos,,,no ha tenido relaciones sexuales,,,,,,,,,,,,,,,,,,,,,,,,,,,,,,,,,,,,,,,,,,,,,,,,,,,,,,,,,,,,,,,,,,,,,,,,,,,,,,,,,,,,,,,,,,,,,,,,,,,no,,,,,,,,,,,,,,,,,,,,no,no,no,no,no,,no,,,ayuda a prevenir algunas malformaciones al nacimiento (malfo,,no,,,,,,,,,,,,,,,,,,,,,,,,,,si la(s) tiene pero no la(s) mostr�,,,,"s�, dice haberse aplicado la vacuna",,1,"s�, dice haberse aplicado la vacuna",,2,"s�, dice haberse aplicado la vacuna",,1,con mucha frecuencia m�s de 2 veces en una semana,con mucha frecuencia m�s de 2 veces en una semana,nunca o casi nunca,nunca o casi nunca,nunca o casi nunca,a veces,con mucha frecuencia m�s de 2 veces en una semana,nunca o casi nunca,s�,caida a nivel de piso,,,escuela,ninguna lesi�n en esta region,contusi�n,ninguna lesi�n en esta region,ninguna lesi�n en esta region,ninguna lesi�n en esta region,laceraci�n,luxaci�n,ninguna lesi�n en esta region,ninguna lesi�n en esta region,ninguna lesi�n en esta region,,amigo(a)/vecino(a),,no estaba bajo efectos del alcohol o drogas,,ning�n problema,,no,,,,,,,,,,,,,,,,,,,,,,,,"no, nunca",,,,,,,,,,,,,,,,no,,,,,,,,,,no,,,,,,,,,,,no,,,,,no,M0102," baja marginalidad + [ metropolitano en  edo<>df | mpios 3,4",metropolitano,baja marginalidad,248.37027,15
010069,5,01,001,0001,mujer,17,mujer,17,,s�,s�,s�,16,actualmente no fuma,88,,,13,una vez al a�o,,nunca,si,s�,no,s�,no,no,s�,no,no,no,no,no,no,,una sola vez,,para ambos,,,no ha tenido relaciones sexuales,,,,,,,,,,,,,,,,,,,,,,,,,,,,,,,,,,,,,,,,,,,,,,,,,,,,,,,,,,,,,,,,,,,,,,,,,,,,,,,,,,,,,,,,,,,,,,,,,,,s�,2,no,no,no,no,no,no,no,no,no,no,no,no,no,no,s�,no,no,,no,no,no,no,no,,no,,,ns/nr,,no,,,,,,,,,,,,,,,,,,,,,,,,,,si la(s) tiene pero no la(s) mostr�,,,,"s�, dice haberse aplicado la vacuna",,1,no,,,"s�, dice haberse aplicado la vacuna",,1,con frecuencia 2 veces en una semana,nunca o casi nunca,nunca o casi nunca,nunca o casi nunca,a veces,nunca o casi nunca,a veces,nunca o casi nunca,no,,,,,,,,,,,,,,,,,,,,,,no,,,,,,,,,,,,,,,,,,,,,,,,"no, nunca",,,,,,,,,,,,,,,,no,,,,,,,,,,no,,,,,,,,,,,no,,,,,no,M0102," baja marginalidad + [ metropolitano en  edo<>df | mpios 3,4",metropolitano,baja marginalidad,248.37027,15
010074,3,01,001,0001,hombre,19,hombre,19,,s�,s�,s�,16,semanal,10,m�s de 1 hora,poco,16,una o dos veces a la semana,1 a 2 veces a la semana,,si,s�,s�,s�,no,no,no,no,no,s�,s�,no,no,,una sola vez,,para ambos,en tomar una o varias pastillas anticonceptivas lo m�s pront,,17,17,s�,no,no,no,no,no,no,no,no,no,no,no,no,no,no,,s�,s�,no,s�,no,no,no,no,no,no,no,no,no,no,no,no,,,no,s�,s�,no,no,no,,,,,,,,,,,,,,,,,,,,,,,,,,,,,,,,,,,,,,,,,,,,,,,,,,,,,,,,,,s�,3,s�,no,no,no,no,no,no,no,no,no,no,no,no,no,no,no,no,,no,no,no,no,no,,s�,s�,s�,ns/nr,,,5,,,,,,,,,,,,,,,,,,,,,,,,,"s�, mostr� la cartilla nacional de salud (adolescentes de 10",,,,"s�, y est� registrado en la cartilla nacional de salud (adol",,2,"s�, y est� registrado en la cartilla nacional de salud (adol",,2,"s�, y est� registrado en la cartilla nacional de salud (adol",,2,nunca o casi nunca,a veces,nunca o casi nunca,nunca o casi nunca,nunca o casi nunca,nunca o casi nunca,a veces,nunca o casi nunca,no,,,,,,,,,,,,,,,,,,,,,,no,,,,,,,,,,,,,,,,,,,,,,,,"no, nunca",,,,,,,,,,,,,,,,no,,,,,,,,,,no,,,,,,,,,,,s� y lo encontraron alto,s�,s�,no,no,s� y los encontraron altos,M0102," baja marginalidad + [ metropolitano en  edo<>df | mpios 3,4",metropolitano,baja marginalidad,286.40714,15
010076,2,01,001,0001,mujer,17,mujer,17,,s�,s�,s�,13,actualmente no fuma,88,,,15,actualmente no toma,,nunca,si,no,s�,s�,no,no,no,no,no,no,no,no,no,,,,,ns/nr,,no ha tenido relaciones sexuales,,,,,,,,,,,,,,,,,,,,,,,,,,,,,,,,,,,,,,,,,,,,,,,,,,,,,,,,,,,,,,,,,,,,,,,,,,,,,,,,,,,,,,,,,,,,,,,,,,,no,,,,,,,,,,,,,,,,,,,,no,no,no,no,no,,no,,,ayuda a prevenir algunas malformaciones al nacimiento (malfo,,no,,,,,,,,,,,,,,,,,,,,,,,,,,si la(s) tiene pero no la(s) mostr�,,,,"s�, dice haberse aplicado la vacuna",,1,"s�, dice haberse aplicado la vacuna",,2,"s�, dice haberse aplicado la vacuna",,1,nunca o casi nunca,a veces,nunca o casi nunca,nunca o casi nunca,nunca o casi nunca,nunca o casi nunca,a veces,nunca o casi nunca,no,,,,,,,,,,,,,,,,,,,,,,no,,,,,,,,,,,,,,,,,,,,,,,,"no, nunca",,,,,,,,,,,,,,,,no,,,,,,,,,,no,,,,,,,,,,,no,,,,,no,M0102," baja marginalidad + [ metropolitano en  edo<>df | mpios 3,4",metropolitano,baja marginalidad,248.37027,15
010085,4,01,001,0001,hombre,18,hombre,18,,s�,s�,no,14,actualmente no fuma,88,,,15,dos o tres veces al mes,una vez al a�o,,si,s�,no,s�,no,no,no,no,no,no,no,no,no,,una sola vez,,para ambos,,,16,18,s�,no,no,no,no,no,no,no,no,no,no,no,no,no,no,,no,s�,no,no,no,no,no,no,no,no,no,no,no,no,no,no,,,no,s�,s�,no,no,no,,,,,,,,,,,,,,,,,,,,,,,,,,,,,,,,,,,,,,,,,,,,,,,,,,,,,,,,,,s�,5,s�,no,no,no,no,no,no,no,no,no,no,no,no,no,no,no,no,,no,no,no,no,no,,no,,,ayuda a prevenir algunas malformaciones al nacimiento (malfo,,,4,,,,,,,,,,,,,,,,,,,,,,,,,si la(s) tiene pero no la(s) mostr�,,,,no,,,"s�, dice haberse aplicado la vacuna",,4,no,,,a veces,nunca o casi nunca,nunca o casi nunca,nunca o casi nunca,nunca o casi nunca,nunca o casi nunca,nunca o casi nunca,nunca o casi nunca,no,,,,,,,,,,,,,,,,,,,,,,no,,,,,,,,,,,,,,,,,,,,,,,,"no, nunca",,,,,,,,,,,,,,,,no,,,,,,,,,,no,,,,,,,,,,,no,,,,,no,M0103," baja marginalidad + [ metropolitano en  edo<>df | mpios 3,4",metropolitano,baja marginalidad,582.03229,15
010097,2,01,001,0001,hombre,11,hombre,11,,s�,s�,no,8,actualmente no fuma,88,,,nunca ha tomado,,,,,,,,,,,,,,,,,,,,,,,,,,,,,,,,,,,,,,,,,,,,,,,,,,,,,,,,,,,,,,,,,,,,,,,,,,,,,,,,,,,,,,,,,,,,,,,,,,,,,,,,,,,,,,,,,,,,,,,,,,,,,,,,,,,,,,,,,,,,,,,,,,,,,,,,,,,,,,,,,,,,,,,,,,,,,,,,,,,si la(s) tiene pero no la(s) mostr�,,,,,,,,,,,,,a veces,nunca o casi nunca,a veces,nunca o casi nunca,nunca o casi nunca,nunca o casi nunca,nunca o casi nunca,nunca o casi nunca,no,,,,,,,,,,,,,,,,,,,,,,no,,,,,,,,,,,,,,,,,,,,,,,,"no, nunca",,,,,,,,,,,,,,,,no,,,,,,,,,,no,,,,,,,,,,,no,,,,,no,M0103," baja marginalidad + [ metropolitano en  edo<>df | mpios 3,4",metropolitano,baja marginalidad,359.10577,15